program: Gaussian 09
title: 000258575
version: EM64L-G09RevD.01
frameworkgroup: C1[X(C12H17NO)]
method: RPBEPBE
basis: SDD
operation: Freq
keyword: #p
keyword: freq=noraman
keyword: PBEPBE/SDD
title: #p freq=noraman PBEPBE/SDD
converged: YES YES NO NO
title: Mulliken charges:
elementType: O N C C C C C C C C C C C C H H H H H H H H H H H H H H H H H
charge: -0.262960 -0.109293 -0.227285 -0.457089 -0.313069 -0.304441 0.386230 -0.682507 -0.380996 -0.393049 -0.382008 -0.382599 0.438647 -0.809571 0.243890 0.258339 0.225991 0.210581 0.212117 0.205775 0.212620 0.228180 0.207346 0.211629 0.263532 0.264257 0.227343 0.226753 0.234608 0.223617 0.223413
chargesum: 0.00000
title: Mulliken charges with hydrogens summed into heavy atoms:
elementType: O N C C C C C C C C C C C C
charge: -0.262960 -0.109293 0.016605 0.027241 0.109630 0.113954 0.386230 -0.035352 -0.117464 -0.128792 -0.154665 -0.155846 0.438647 -0.127933
polarizability: 1.80022311e+02 8.42753159e-01 1.31321597e+02 5.06118867e+00 -4.25182608e+00 9.42983893e+01
1716.lowfreq: -9.5296 -4.7864 -0.0006 -0.0004 -0.0004 10.9202 35.0325 38.8876 53.1007
frequency: 34.9732 38.8406 53.0949 66.1740 95.5060 112.3463 149.9598 205.7265 236.5971 269.4518 294.4645 325.2533 330.3542 380.6360 410.0319 482.1771 490.8765 565.9533 633.8806 654.1381 710.7686 715.2315 756.3483 771.9191 797.0586 800.7889 820.8880 853.2198 862.3803 888.2318 911.0903 947.5581 968.8478 973.8153 984.4040 988.3562 1015.2782 1046.9531 1050.1259 1053.5035 1102.6675 1114.5841 1125.4095 1165.5767 1169.5069 1178.9389 1213.1286 1215.3777 1219.5055 1252.7066 1286.7353 1297.3232 1301.1792 1306.9754 1324.3236 1361.1602 1372.0064 1392.8339 1395.5857 1400.4365 1461.8567 1471.1899 1472.1497 1472.5278 1474.6249 1486.3093 1490.5749 1502.2532 1582.4238 1623.2451 2911.8610 2972.8541 2984.7892 2996.2881 3027.9678 3029.3646 3039.7486 3053.7614 3055.4156 3077.3700 3082.2759 3092.5209 3103.5466 3115.4087 3118.0185 3149.1356 3155.7830
redmass: 1.0546 3.2608 3.2899 2.7937 2.5245 1.8702 3.5052 4.3220 1.4399 2.1935 3.6152 3.5503 2.9836 3.0719 2.9239 2.9841 3.0705 4.5072 6.8821 3.8809 4.1522 4.7019 2.4601 3.6408 1.1895 1.8842 1.9533 3.0896 1.2499 3.7062 3.0933 2.8630 2.3658 1.4611 1.3917 1.3737 2.8247 1.5956 2.6388 2.1490 1.9919 1.2970 1.7238 1.4544 1.4583 1.2043 2.6596 1.2845 2.5924 1.3111 1.1766 1.3014 1.2101 1.3142 1.5456 1.6399 3.2455 1.2404 1.2254 3.2910 1.0676 1.0561 1.0909 1.0537 1.0725 1.0625 1.0883 2.7310 6.4346 6.4326 1.0688 1.0385 1.0359 1.0569 1.0888 1.0665 1.0868 1.0950 1.1069 1.0986 1.0997 1.1006 1.1050 1.0888 1.0890 1.0942 1.0951
irintensity: 0.5290 0.1328 0.9411 1.2811 2.8695 0.9078 1.8359 4.8927 0.3294 1.4757 4.3300 2.2427 1.4639 6.6483 0.0472 7.8537 12.4474 4.8104 0.9740 13.8580 3.8880 6.3573 39.5038 9.6816 11.4643 47.6718 20.3453 6.6621 0.0370 32.4492 3.9498 32.7739 11.1475 4.7129 0.6736 0.3809 8.7185 32.8746 49.8437 18.2683 6.1830 5.3008 19.3844 6.3283 1.8048 19.5296 14.7000 3.5203 0.0070 5.8256 10.3906 7.3193 3.2259 16.3884 52.4428 2.5087 2.4073 21.6305 9.9252 3.1235 6.0142 8.9739 15.7217 11.3359 16.1142 7.9376 4.8598 25.5226 0.1896 4.0836 69.7866 40.8552 30.3674 68.9228 2.7234 40.7870 14.5076 23.8989 31.0143 60.0198 18.3218 31.8526 47.3454 18.8681 18.9035 15.2502 3.2322
temp: 298.150 k
press: 1.00000 atm
elementType: 8 7 6 6 6 6 6 6 6 6 6 6 6 6 1 1 1 1 1 1 1 1 1 1 1 1 1 1 1 1 1
symmnumber: 1
zpe: 693513.7 jmol-1
zpe.correction: 0.264145 hartree
zpe.thermalcorrener: 0.278221 hartree
zpe.thermalcorrenthalpy: 0.279166 hartree
zpe.thermalcorrgfe: 0.221764 hartree
zpe.sumelectzpe: -596.361535 hartree
zpe.sumelectthermal: -596.347459 hartree
zpe.sumelectthermalent: -596.346515 hartree
zpe.sumelectthermalfe: -596.403916 hartree
dipole: -0.6977 -0.9474 1.1341
dipole: 1.6342
quadrupole: -72.2510 -85.8496 -83.9981
quadrupole: 1.1853 -0.7909 2.6358
quadrupole: 8.4486 -5.1500 -3.2986 1.1853 -0.7909 2.6358
hfenergy: -596.6256807 hartree
pointgroup: C01[X(C12H17N1O1)]
dipole: 0.3108263 0.0345026 0.5617414 debye
polarizability: 176.4931338|14.4828222|114.0930024|-10.1631253|17.3687386|115.0561618 unknown
InChI: InChI=1S/C12H17NO/c1-3-13-8-9-14-12(13)11-6-4-10(2)5-7-11/h4-7,12H,3,8-9H2,1-2H3
charge 0 multiplicity 1
31 atoms
O  1.417879 -0.736681 -1.704723
N  1.88219 0.765595 0.080107
C  0.911237 0.499065 -0.986666
C  2.179395 -0.604942 0.601681
C  2.093347 -1.543413 -0.657099
C  3.08902 1.526196 -0.368636
C  -0.508581 0.271394 -0.463143
C  3.9028 2.060252 0.821977
C  -1.396072 -0.590156 -1.152058
C  -0.97525 0.958544 0.683476
C  -2.7228 -0.759959 -0.699706
C  -2.302631 0.782598 1.13274
C  -3.201939 -0.07365 0.446346
C  -4.639804 -0.234795 0.910621
H  0.931883 1.30139 -1.745082
H  1.41073 -0.883207 1.342372
H  3.164282 -0.628492 1.093222
H  3.084231 -1.830603 -1.05184
H  1.502088 -2.45294 -0.442111
H  3.741448 0.916363 -1.035919
H  2.726942 2.381398 -0.968859
H  3.268646 2.693155 1.466896
H  4.309669 1.241657 1.443525
H  4.757834 2.662706 0.463676
H  -1.027978 -1.135475 -2.027553
H  -0.279592 1.612158 1.22096
H  -3.396102 -1.437043 -1.240435
H  -2.646089 1.315137 2.028754
H  -5.297477 0.521337 0.438647
H  -5.041728 -1.228844 0.645737
H  -4.729776 -0.109244 2.004292
