program: Gaussian 09
title: 000258622
version: EM64L-G09RevD.01
frameworkgroup: C1[X(C20H21N2O3P)]
method: RPBEPBE
basis: SDD
operation: Freq
keyword: #p
keyword: freq=noraman
keyword: PBEPBE/SDD
title: #p freq=noraman PBEPBE/SDD
converged: NO YES NO NO
title: Mulliken charges:
elementType: P O O O N N C C C C C C C C C C C C C C C C C C C C H H H H H H H H H H H H H H H H H H H H H
charge: 1.330297 -0.537064 -0.556300 -0.587298 -0.783096 -0.064489 0.231608 0.234395 0.324042 0.331076 0.222209 -0.329693 -0.317764 -0.386163 -0.381514 -0.257088 -0.792839 -0.800311 0.450790 -0.226385 -0.219699 -0.237947 -0.231438 -0.307103 -0.507130 -0.804860 0.375816 0.294779 0.248944 0.233261 0.235590 0.275563 0.251409 0.233014 0.218802 0.217995 0.240836 0.273796 0.231169 0.230594 0.241638 0.227775 0.228768 0.248848 0.227237 0.234442 0.233486
chargesum: 0.00000
title: Mulliken charges with hydrogens summed into heavy atoms:
elementType: P O O O N N C C C C C C C C C C C C C C C C C C C C
charge: 1.330297 -0.537064 -0.556300 -0.587298 -0.407280 -0.064489 0.231608 0.234395 0.324042 0.331076 0.222209 -0.034914 -0.068820 -0.152902 -0.145924 0.018475 -0.089613 -0.067684 0.450790 0.004784 0.010895 -0.010172 -0.002669 -0.065465 -0.258282 -0.109695
polarizability: 3.05883167e+02 3.75565730e+00 2.46492098e+02 -1.33223628e+01 -6.85811543e+00 2.43984382e+02
1716.lowfreq: -4.3177 0.0013 0.0014 0.0016 4.1876 4.9248 12.3232 16.6062 21.5852
frequency: 12.0521 16.5735 21.5247 27.3764 33.3615 40.2786 68.7775 79.5406 93.4442 100.0829 112.4678 126.3673 133.1359 149.3335 171.7654 184.0782 191.6441 207.5486 226.7074 241.3206 278.6380 282.1509 311.4221 329.7838 332.4472 356.0213 412.1230 413.7337 418.6656 439.3635 448.6907 452.1510 481.1422 495.8594 498.4184 534.7346 538.7861 546.5695 575.8507 578.7398 590.9812 622.8384 644.6119 669.6355 713.0978 717.5141 725.4118 756.2081 758.9750 764.0004 767.0030 768.7396 814.3774 832.2522 839.9434 845.6687 863.1290 870.9230 921.5171 929.0067 942.8475 949.6110 969.3738 982.8473 983.7775 984.5277 985.9670 987.7523 1010.6979 1036.3632 1040.2808 1048.2393 1048.4240 1050.7892 1053.4626 1092.5465 1098.6962 1141.5370 1155.3343 1163.4072 1171.1614 1176.8641 1222.9074 1228.8387 1232.2427 1244.6539 1278.9575 1286.1206 1302.9254 1333.5779 1369.1730 1375.7683 1376.0373 1399.6099 1400.0928 1403.8940 1407.3031 1427.4306 1428.3400 1461.3247 1463.0058 1470.5925 1474.3346 1475.4659 1477.0078 1481.3280 1483.1664 1487.4376 1567.5678 1586.9188 1592.2100 1604.3622 1608.6593 1612.9192 2977.3497 2979.7593 2981.6519 3056.1126 3058.2320 3062.7038 3084.1843 3089.7301 3094.3138 3124.1020 3124.4800 3126.9663 3132.5297 3139.2198 3140.8259 3154.7160 3157.6317 3168.4652 3173.8244 3180.8976 3510.4122
redmass: 4.6294 4.5596 4.1895 4.7785 4.2398 4.3259 3.9804 1.1990 5.8075 4.8228 3.0981 1.1128 1.1461 3.1883 3.5691 5.0174 5.1659 5.7038 4.5743 4.7502 5.3964 4.8303 4.4227 3.8850 3.6487 4.2034 3.9100 4.1304 6.3296 3.1649 3.1404 4.1684 5.0671 4.9516 2.1120 5.1533 3.9253 5.6687 5.9900 5.4276 1.5807 7.4324 8.1230 6.0481 2.6767 3.2173 5.2804 4.0180 5.1688 1.6611 1.8452 1.8772 6.2029 1.6641 4.6155 5.7085 1.3422 1.3030 1.3279 5.1309 1.3820 1.3707 1.3547 1.6998 1.3444 1.5352 1.3421 1.6200 2.3851 4.7412 2.0687 2.0093 1.8526 1.5359 1.5603 2.7032 2.5001 1.3742 1.9107 1.9302 1.0634 1.1376 2.5863 2.5029 2.7461 1.8155 1.4873 1.4329 1.7782 6.1920 2.1468 7.2756 7.2642 1.5191 1.2613 1.2417 1.4638 2.0015 2.0740 1.0486 1.0519 1.0452 1.2957 2.0788 1.3335 1.9255 1.4199 1.8348 4.9600 5.9789 6.0880 6.1959 6.9100 7.0934 1.0372 1.0367 1.0373 1.0980 1.0971 1.0973 1.0985 1.0997 1.0996 1.0920 1.0872 1.0864 1.0913 1.0894 1.0900 1.0942 1.0950 1.1007 1.0993 1.0954 1.0747
irintensity: 0.1236 0.3885 0.0615 0.1434 0.6748 0.4552 0.4056 0.6601 1.3162 1.1961 1.1259 0.5464 0.2208 0.1120 3.2967 3.3598 2.1456 4.5170 0.9475 18.0217 1.8597 4.3715 1.9346 2.9269 0.0535 19.3519 7.5816 11.2029 66.5712 0.6792 22.7463 47.5769 7.8091 15.7403 60.3624 5.5141 1.7302 10.8333 8.0699 7.6832 20.6086 9.0870 19.0337 115.2917 6.1856 2.3288 8.5212 3.0267 44.7299 61.0526 75.2064 183.2141 29.3593 14.0902 190.6603 142.9800 7.3949 2.0222 2.4185 214.4366 3.4909 9.3796 3.1548 0.8667 0.4385 2.4739 1.2129 2.1587 7.8244 83.2189 20.3884 16.4623 13.1270 11.9707 12.4011 177.0191 76.1200 8.1989 112.6445 59.7280 0.6111 20.5408 15.9043 8.9109 24.3508 1.3451 3.3082 1.8019 119.4398 27.8095 176.5213 3.2360 1.1453 0.0130 7.4910 18.0485 15.2790 31.9902 11.9430 7.6997 14.5790 13.0442 55.0879 38.4238 16.9380 254.8108 168.5483 75.5715 24.7545 14.9762 17.6907 81.9177 14.2307 1.2557 43.1468 22.9934 18.0312 19.2982 15.8732 9.0949 17.0371 24.3797 24.2040 31.0947 6.0770 4.4975 13.5033 15.4390 12.3558 10.2685 32.9087 24.2750 10.1416 1.7219 84.2024
temp: 298.150 k
press: 1.00000 atm
elementType: 15 8 8 8 7 7 6 6 6 6 6 6 6 6 6 6 6 6 6 6 6 6 6 6 6 6 1 1 1 1 1 1 1 1 1 1 1 1 1 1 1 1 1 1 1 1 1
symmnumber: 1
zpe: 960214.3 jmol-1
zpe.correction: 0.365726 hartree
zpe.thermalcorrener: 0.391490 hartree
zpe.thermalcorrenthalpy: 0.392435 hartree
zpe.thermalcorrgfe: 0.305808 hartree
zpe.sumelectzpe: -1449.271423 hartree
zpe.sumelectthermal: -1449.245659 hartree
zpe.sumelectthermalent: -1449.244715 hartree
zpe.sumelectthermalfe: -1449.331341 hartree
dipole: -1.6726 -0.9229 3.3699
dipole: 3.8737
quadrupole: -141.6917 -152.3786 -155.3731
quadrupole: -0.3577 -4.5734 -0.5956
quadrupole: 8.1228 -2.5641 -5.5586 -0.3577 -4.5734 -0.5956
hfenergy: -1449.6371496 hartree
pointgroup: C01 [X(C20H21N2O3P1)]
dipole: -0.1779962 -0.4107675 1.4567929 debye
polarizability: 267.5049984|27.5304255|276.5347374|-9.3714883|-21.6941466|252.3199114 unknown
InChI: InChI=1S/C20H21N2O3P/c1-15-12-13-20(21-14-15)22-26(23,24-18-10-6-4-8-16(18)2)25-19-11-7-5-9-17(19)3/h4-14,22H,1-3H3
charge 0 multiplicity 1
47 atoms
P  0.423058 -0.094896 -1.246057
O  -0.61118 0.696554 -0.077199
O  1.819715 -0.182377 -0.230494
O  0.548383 0.572652 -2.682334
N  -0.053591 -1.746771 -1.339046
N  -0.771673 -3.882578 -0.790456
C  -1.935398 1.151795 -0.382842
C  2.591735 0.982624 0.104621
C  -2.87304 1.044387 0.67803
C  3.702587 1.315592 -0.712226
C  -0.2515 -2.713525 -0.323142
C  -2.258569 1.728558 -1.629838
C  2.268463 1.684382 1.282261
C  -4.176371 1.543701 0.435709
C  4.499689 2.407945 -0.285109
C  0.06314 -2.502895 1.045227
C  -2.48305 0.427289 2.005107
C  4.010363 0.541172 -1.97702
C  -0.743538 -4.783636 1.493663
C  -3.571549 2.206374 -1.839082
C  3.080946 2.768911 1.679295
C  -4.53172 2.116892 -0.80695
C  4.199411 3.129007 0.893173
C  -0.194701 -3.552953 1.945889
C  -1.001721 -4.883907 0.105414
C  -1.032342 -5.932953 2.438264
H  -0.280393 -2.091117 -2.278933
H  -1.498532 1.801919 -2.414455
H  1.387619 1.385965 1.858681
H  -4.921255 1.474684 1.237396
H  5.367436 2.69307 -0.891276
H  0.51747 -1.567012 1.377893
H  -2.073994 -0.590312 1.8677
H  -1.695754 1.021133 2.506161
H  -3.352629 0.366289 2.681247
H  4.935305 0.911339 -2.449921
H  4.132055 -0.536722 -1.764917
H  3.184928 0.633512 -2.707513
H  -3.834504 2.652556 -2.804143
H  2.840202 3.326021 2.590841
H  0.041541 -3.419289 3.008251
H  -5.548813 2.490796 -0.965752
H  4.834693 3.968959 1.194555
H  -1.414201 -5.808288 -0.317068
H  -1.440461 -6.803434 1.89598
H  -0.117405 -6.26396 2.964385
H  -1.768447 -5.645051 3.212131
