program: Gaussian 09
title: 000258566
version: EM64L-G09RevD.01
frameworkgroup: C1[X(C10H10N2O3)]
method: RPBEPBE
basis: SDD
operation: Freq
keyword: #p
keyword: freq=noraman
keyword: PBEPBE/SDD
title: #p freq=noraman PBEPBE/SDD
converged: NO YES NO NO
title: Mulliken charges:
elementType: O O O N N C C C C C C C C C C H H H H H H H H H H
charge: -0.255250 -0.213828 -0.197433 -0.226959 0.019104 -0.544794 -0.367476 0.205190 0.311945 -0.451909 -0.341427 0.192732 0.421538 -0.400218 -0.769036 0.251191 0.251230 0.241070 0.240983 0.358906 0.249873 0.287679 0.231785 0.273180 0.231925
chargesum: 0.00000
title: Mulliken charges with hydrogens summed into heavy atoms:
elementType: O O O N N C C C C C C C C C C
charge: -0.255250 -0.213828 -0.197433 -0.226959 0.019104 -0.042373 0.114577 0.205190 0.311945 -0.093004 -0.091554 0.192732 0.421538 -0.112539 -0.032145
polarizability: 1.94438250e+02 2.97618560e-01 1.56780612e+02 -1.01737712e-03 4.46748840e-03 6.31565076e+01
1716.lowfreq: -50.5016 -8.9582 -6.3561 -3.1950 0.0004 0.0005 0.0006 47.9066 70.6711
frequency: -50.3120 47.9051 70.6467 89.7993 118.9988 129.0085 137.6058 230.7649 263.2568 296.8035 315.3966 338.4299 399.2335 434.0938 500.8246 524.9390 538.4770 551.8817 584.7743 622.9005 662.2531 702.2722 713.0627 736.2138 770.4658 823.6982 852.1534 858.1240 931.0043 952.4407 972.7434 994.1832 1018.8461 1029.0364 1048.1705 1061.3144 1098.1353 1125.6649 1170.9126 1181.7527 1211.6020 1229.0990 1229.3393 1244.3894 1283.7513 1321.5313 1364.9523 1370.4717 1380.0470 1421.5855 1438.2478 1445.6247 1459.2740 1466.6455 1479.9217 1492.1403 1589.4076 1606.0968 1620.2233 2987.1041 2998.5047 3010.9506 3044.6155 3068.3890 3070.8571 3137.1054 3148.6355 3191.6805 3213.7267
redmass: 1.8330 11.2761 2.8655 4.3255 1.2057 7.8594 4.9045 6.4616 4.4770 4.5725 4.7404 5.7968 7.3508 3.0754 5.8630 4.6859 4.1519 4.7213 3.6305 5.5636 6.8098 5.1343 2.8737 6.9712 6.3583 1.3890 1.3702 5.8263 3.2784 1.4095 1.3381 2.8738 1.9948 1.6747 1.7473 2.1016 2.8428 2.6365 2.2246 1.1592 9.6535 1.1910 1.7624 1.5907 2.1214 1.7263 2.7446 5.5328 1.4406 4.7113 4.7649 1.0973 1.2071 1.0483 2.0318 1.3277 7.3705 8.3388 8.0244 1.0388 1.0580 1.0611 1.1057 1.1053 1.0979 1.0981 1.0912 1.0945 1.0934
irintensity: 0.7161 0.0374 3.7262 0.1083 0.0095 0.3634 0.4648 7.3606 6.7487 1.7443 0.1602 1.0658 2.4318 6.0877 3.8685 3.0277 0.1247 8.3155 1.0758 12.1025 4.9310 13.2583 11.5866 10.5794 14.4484 4.9460 28.9146 11.0258 3.1571 33.2333 2.4545 6.1032 14.3491 3.9845 3.7043 29.0360 23.5759 13.3394 23.2783 0.2607 255.9221 6.0329 24.0807 52.9996 36.3072 167.5715 167.0645 25.0186 83.5059 59.8832 110.5608 23.9074 18.5031 23.3685 108.2732 74.0894 148.8255 40.7400 12.0110 5.4568 28.5737 43.0540 0.8568 24.7577 19.1157 6.5974 10.7686 2.4183 19.1048
temp: 298.150 k
press: 1.00000 atm
elementType: 8 8 8 7 7 6 6 6 6 6 6 6 6 6 6 1 1 1 1 1 1 1 1 1 1
symmnumber: 1
zpe: 493005.6 jmol-1
zpe.correction: 0.187776 hartree
zpe.thermalcorrener: 0.200214 hartree
zpe.thermalcorrenthalpy: 0.201159 hartree
zpe.thermalcorrgfe: 0.148137 hartree
zpe.sumelectzpe: -721.091825 hartree
zpe.sumelectthermal: -721.079387 hartree
zpe.sumelectthermalent: -721.078443 hartree
zpe.sumelectthermalfe: -721.131465 hartree
dipole: 7.3648 6.7265 -0.0013
dipole: 9.9743
quadrupole: -89.0238 -89.4213 -86.1705
quadrupole: -2.9651 -0.0020 0.0046
quadrupole: -0.8187 -1.2161 2.0347 -2.9651 -0.0020 0.0046
hfenergy: -721.2796012 hartree
pointgroup: C01 [X(C10H10N2O3)]
dipole: -2.8644952 2.6821483 0.00045 debye
dipolederiv: -0.5085092 0.2942518 0.0000241 -0.2921111 -1.0865632 0.0002568 -0.0000805 -0.0004659 -0.3394636 -1.0087455 -0.0283534 0.0003794 -0.0189073 -0.4632586 0.0001669 0.0004391 0.0001832 -0.2326064 -0.5262903 0.0769957 0.0001114 0.140564 -0.8350046 0.0004068 0.0000659 0.0003668 -0.2203584 -1.3362946 -0.6142463 0.0008016 -0.7043976 -1.0248061 0.0001447 0.0006803 0.000747 -0.1890723 1.6573268 -0.3008513 -0.0005097 -0.4479344 1.2762155 -0.0005826 -0.0004632 -0.000613 0.1830584 -0.1162765 0.0186577 0.0001313 0.1685151 -0.0325309 0.0001117 -0.0003018 0.0005567 0.1597061 0.3413043 -0.1266009 -0.0002009 -0.2100441 0.2486629 0.000525 -0.0002837 0.0000634 0.2907769 0.1464872 -0.227309 0.0001345 -0.4262237 0.0483382 0.0000932 0.0006228 -0.0002962 -0.06295 1.073397 0.5313298 -0.0007965 0.5365707 -0.1922934 -0.0001714 -0.0009448 -0.0001775 0.0793639 -0.1106562 -0.3145341 0.0002446 0.1525037 -0.0497411 -0.0001402 -0.0000386 0.0001444 -0.1224701 -0.1726573 0.1340012 -0.0001027 0.0846475 0.1954668 -0.0003154 -0.0001357 -0.0003289 -0.1437478 1.1106101 0.2079434 -0.0002382 0.8550211 1.7522771 -0.0004901 0.0000848 0.0001867 0.162545 -0.3833803 0.3739724 -0.0000952 0.3607506 -0.160837 -0.0000422 -0.0000428 0.0000118 0.0493525 -0.1232327 -0.0498657 0.0000405 -0.2276545 -0.0149742 0.0000482 0.0001604 -0.0000037 -0.1273841 -0.4653785 -0.0777418 0.0000348 0.0116549 -0.0031181 0.0000909 -0.0006825 -0.0000089 0.0601901 0.0216602 0.0338107 0.0164575 0.0011714 0.0041359 -0.0790243 0.0442016 -0.1229737 -0.0174883 0.0213545 0.0339956 -0.0166092 0.0010879 0.004833 0.0789083 -0.0441512 0.1228584 -0.018217 -0.0527705 0.0332086 0.0826308 0.0118993 0.0442307 0.0188324 0.1367992 -0.0062297 -0.0500782 -0.0536479 0.0331294 -0.0826421 0.0115085 0.0445743 -0.0190339 -0.1365531 0.005792 -0.0490646 0.1938921 0.007861 -0.0000155 0.0032185 0.1377311 0.0000469 0.0000358 0.0000083 0.1928934 0.0825551 0.0032114 0.0000315 -0.0142371 -0.0920612 0.0001865 0.0000634 0.0001706 0.1509779 0.0459411 -0.0461895 0.00009 -0.0166076 0.122013 0.0000489 0.0000872 0.0000458 0.1770402 0.036227 0.0053519 0.0264569 0.0542941 0.0681603 -0.1096569 0.0712221 -0.0781905 -0.0306292 0.0908263 -0.0071268 0.0000632 -0.0891687 -0.0603715 0.0003978 0.0002703 0.0003167 0.1288114 0.0362576 0.0050982 -0.0264221 0.0538785 0.0689213 0.109192 -0.0710551 0.0778361 -0.0311857 unknown
polarizability: 194.4250487|-0.7646618|156.7937657|-0.0551115|-0.0477772|63.1565552 unknown
InChI: InChI=1S/C10H10N2O3/c1-7(13)11-5-4-8-2-3-9(12(14)15)6-10(8)11/h2-3,6H,4-5H2,1H3
charge 0 multiplicity 1
25 atoms
O  -1.711884 -2.37125 0.001181
O  4.21981 -0.320979 -0.001477
O  2.867768 -2.15617 0.000477
N  -1.912723 -0.049213 0.001478
N  3.053721 -0.879983 -0.000413
C  -1.707996 2.375769 -0.000815
C  -2.73744 1.203052 0.002277
C  -0.355764 1.683202 -0.000582
C  -0.52628 0.271578 0.000552
C  0.580508 -0.603372 0.00062
C  0.929639 2.248096 -0.001595
C  -2.452267 -1.343451 0.001958
C  1.857082 0.004797 -0.000392
C  2.061526 1.402054 -0.001492
C  -3.973701 -1.433173 0.002207
H  -1.829922 3.022614 0.88632
H  -1.831195 3.01904 -0.89039
H  -3.384171 1.230156 0.897288
H  -3.388257 1.228744 -0.889772
H  0.4632 -1.687124 0.001405
H  1.057752 3.335439 -0.002486
H  3.080649 1.794747 -0.00224
H  -4.411753 -0.947903 0.893952
H  -4.248245 -2.497505 0.00429
H  -4.411461 -0.951663 -0.89175
