program: Gaussian 09
title: 000258564
version: EM64L-G09RevD.01
frameworkgroup: C1[X(C10H12N2O)]
method: RPBEPBE
basis: SDD
operation: Freq
keyword: #p
keyword: freq=noraman
keyword: PBEPBE/SDD
title: #p freq=noraman PBEPBE/SDD
converged: NO YES NO NO
title: Mulliken charges:
elementType: O N N C C C C C C C C C C H H H H H H H H H H H H
charge: -0.282069 -0.222230 -0.708713 -0.544126 -0.367914 0.199440 0.306467 -0.538297 -0.362206 0.176602 0.565741 -0.464233 -0.772962 0.234186 0.234467 0.232493 0.231921 0.303666 0.230090 0.213799 0.227891 0.265798 0.228462 0.301167 0.310560
chargesum: 0.00000
title: Mulliken charges with hydrogens summed into heavy atoms:
elementType: O N N C C C C C C C C C C
charge: -0.282069 -0.222230 -0.096986 -0.075473 0.096499 0.199440 0.306467 -0.234631 -0.132116 0.176602 0.565741 -0.250434 -0.050810
polarizability: 1.75209136e+02 -3.97794279e+00 1.44180319e+02 1.99440559e-02 -7.88160762e-03 6.29813528e+01
1716.lowfreq: -54.6187 -4.6285 -0.0007 0.0002 0.0004 6.0720 7.2636 73.7018 99.1849
frequency: -54.5438 73.6956 99.1766 134.4253 157.4385 169.2450 283.6550 293.3550 299.9642 344.3951 351.1361 378.1846 430.1849 440.9313 444.5203 537.5506 565.7971 567.5662 634.5960 637.7338 714.5892 724.5117 781.5020 800.6809 838.8547 876.8837 895.4094 924.3574 942.3163 992.1192 1017.2121 1026.1989 1030.3211 1045.5202 1104.1480 1111.6537 1169.6328 1179.5465 1216.5870 1230.8482 1246.7190 1288.0750 1322.4339 1326.0633 1374.0249 1386.5573 1406.9170 1445.7609 1463.3065 1468.6251 1474.4374 1490.1408 1508.2139 1583.4030 1600.7489 1635.2274 1642.6093 2985.0917 2986.4642 3000.2401 3028.4233 3056.3550 3068.7992 3119.4360 3132.0977 3143.2383 3185.5495 3571.3006 3712.9679
redmass: 1.7923 2.7552 3.7292 1.1963 4.0592 4.9233 4.8955 3.2489 3.3929 1.2666 4.0979 1.0613 4.6567 4.4766 2.8162 4.2781 3.0750 4.4979 3.8205 5.2762 2.3827 5.9043 4.7072 1.5351 1.3152 5.2293 1.5222 1.3317 2.5869 2.7937 1.9122 1.6593 1.5877 1.6837 3.4747 2.0020 1.8036 1.1579 1.9065 1.0799 1.5262 1.9680 2.1926 1.7839 1.3839 3.4142 4.4049 1.1064 1.8075 1.0487 1.6158 1.1788 3.6639 6.4280 7.4989 1.9505 2.0918 1.0431 1.0530 1.0603 1.1052 1.1063 1.0978 1.0870 1.0982 1.0968 1.0929 1.0448 1.1041
irintensity: 1.0535 4.7334 4.6713 0.5861 5.7113 8.6126 0.8991 2.0023 0.0917 282.4330 1.1381 33.2843 6.8375 0.5563 5.5150 6.2070 0.1136 7.5368 8.8621 5.1260 2.0119 1.0045 1.5788 36.5847 12.4855 15.5414 47.5177 0.4758 4.7638 1.8487 7.3602 4.3967 1.5823 1.7951 13.0370 31.7178 5.8562 0.2901 11.9987 0.5135 36.8071 16.0596 15.0376 118.8128 24.2642 224.4276 23.6843 43.5049 33.2390 21.6116 46.4985 11.9028 178.0373 186.1128 24.0656 5.2170 377.6271 10.2758 23.1523 93.8036 0.9207 44.1832 17.7980 14.9587 9.3427 29.3975 6.7024 66.8102 20.3574
temp: 298.150 k
press: 1.00000 atm
elementType: 8 7 7 6 6 6 6 6 6 6 6 6 6 1 1 1 1 1 1 1 1 1 1 1 1
symmnumber: 1
zpe: 533054.0 jmol-1
zpe.correction: 0.203030 hartree
zpe.thermalcorrener: 0.214353 hartree
zpe.thermalcorrenthalpy: 0.215298 hartree
zpe.thermalcorrgfe: 0.166169 hartree
zpe.sumelectzpe: -572.065913 hartree
zpe.sumelectthermal: -572.054589 hartree
zpe.sumelectthermalent: -572.053645 hartree
zpe.sumelectthermalfe: -572.102773 hartree
dipole: 0.2767 2.8071 0.0234
dipole: 2.8208
quadrupole: -57.5145 -74.0762 -80.3088
quadrupole: -11.9754 0.0169 -0.0641
quadrupole: 13.1187 -3.4430 -9.6756 -11.9754 0.0169 -0.0641
hfenergy: -572.2689425 hartree
pointgroup: C01 [X(C10H12N2O1)]
dipole: 0.1761411 1.0956949 0.0097962 debye
dipolederiv: -0.5541794 0.1371165 0.0005264 -0.475984 -1.151711 -0.0025125 -0.0024387 -0.0034802 -0.3561352 -1.4606591 -0.4479003 -0.0006681 -0.4723545 -0.7478559 -0.0034256 -0.0002096 0.0023362 -0.180375 -0.681077 0.6643248 -0.0005124 0.805384 -1.011103 -0.0015755 0.0014847 -0.0035038 -0.7531152 -0.0055878 -0.0548319 0.0006218 0.0529694 0.08643 -0.0000145 -0.0004966 0.0022762 0.2059077 0.2426215 -0.1185472 -0.0006752 -0.1858866 0.3539036 0.003402 -0.0026849 0.0006161 0.2950573 -0.433885 -0.1053015 0.0006955 -0.3337479 -0.1136871 -0.0001335 0.003258 -0.0041322 -0.1378354 1.0508479 -0.014383 -0.0003924 0.076668 0.219699 -0.0006547 -0.0008117 -0.000556 0.0822374 -0.473966 0.4011486 0.0000682 0.1017495 -0.174687 -0.0000337 0.0003261 0.0000567 -0.2485542 0.4209254 0.0279163 -0.0003169 -0.1054005 0.1631951 -0.0003055 -0.0005773 0.0000262 -0.1272332 1.3488069 0.2912995 0.0010882 0.8877462 1.4704288 0.0038494 0.0040205 0.0039444 0.1462458 0.6607954 -0.7056273 0.0003608 -0.9530375 1.0627861 0.0000222 0.0008035 0.0000261 0.1441277 -0.1161768 -0.1058366 0.0003711 0.5103457 -0.4195652 0.0003578 -0.0005992 0.0008789 -0.2658672 -0.4304062 0.0582009 -0.0000456 0.1464426 -0.0156696 0.0001772 -0.0023808 0.0004813 0.0663207 0.0257078 0.0335918 -0.0017567 0.0278736 -0.0706536 -0.0932941 0.0282384 -0.164246 -0.0416799 0.0235038 0.0364824 0.0008031 0.0287044 -0.0670351 0.0930688 -0.0290829 0.1652957 -0.0467896 -0.038922 0.0570686 0.0905439 0.0313994 0.0115586 -0.0068874 0.1368968 -0.0495679 -0.0630583 -0.0446532 0.0595569 -0.0906751 0.0324096 0.014213 0.0066104 -0.1360411 0.0469634 -0.0563928 0.1519376 -0.0269643 -0.000092 0.0093308 0.0079175 0.0001114 0.0003411 -0.0001615 0.1952614 0.0560018 -0.0679597 0.0000654 -0.0969556 -0.100132 0.0001958 0.0004603 0.0001007 0.1471496 -0.1692469 -0.0051213 -0.0002603 0.0190174 0.07359 -0.0000028 -0.0004223 -0.0001251 0.1759683 0.0426548 0.0107262 -0.0007336 0.0668751 0.0460219 -0.1151608 0.0570089 -0.0966129 -0.0384132 0.0447861 -0.0484912 0.0005828 -0.1332292 -0.0339372 0.0011658 0.0011779 0.0006636 0.1247816 0.0421921 0.0103811 0.0001371 0.0661434 0.0486833 0.1137382 -0.0565745 0.0954385 -0.0398232 0.1665575 -0.0530304 -0.000145 -0.0489421 0.1538695 0.0004994 -0.0010105 0.0008575 0.3867095 0.1314209 -0.0338186 0.0004092 -0.0575211 0.1937401 0.000802 -0.0006863 0.0024243 0.3855053 unknown
polarizability: 174.6079204|-5.8410199|144.7815162|0.0325701|0.0308529|62.9813711 unknown
InChI: InChI=1S/C10H12N2O/c1-7(13)12-5-4-8-2-3-9(11)6-10(8)12/h2-3,6H,4-5,11H2,1H3
charge 0 multiplicity 1
25 atoms
O  -1.863407 -2.116972 -0.006785
N  -1.372762 0.166986 0.000125
N  3.095834 -2.038773 0.00104
C  -0.488929 2.441477 -0.004999
C  -1.806279 1.602811 0.00941
C  0.610699 1.391213 -0.000636
C  0.056396 0.085057 -0.000059
C  0.855126 -1.072881 -0.000171
C  2.006672 1.540136 -0.000433
C  -2.259269 -0.907018 -0.001726
C  2.272398 -0.909605 0.000473
C  2.840627 0.399209 0.000418
C  -3.745386 -0.555031 -0.00059
H  -0.432181 3.105629 0.877169
H  -0.440097 3.087374 -0.901258
H  -2.410145 1.807678 0.912094
H  -2.434602 1.812925 -0.874869
H  0.387155 -2.059171 -0.000729
H  2.456829 2.539685 -0.001275
H  3.930821 0.51607 0.001046
H  -4.027325 0.038997 0.888581
H  -4.311438 -1.497658 0.005904
H  -4.030192 0.02763 -0.896414
H  4.106637 -1.947965 0.00194
H  2.693616 -2.971003 0.005844
