program: Gaussian 09
title: 000258583
version: EM64L-G09RevD.01
frameworkgroup: C1[X(C16H15NO4)]
method: RPBEPBE
basis: SDD
operation: Freq
keyword: #p
keyword: freq=noraman
keyword: PBEPBE/SDD
title: #p freq=noraman PBEPBE/SDD
converged: YES YES NO NO
title: Mulliken charges:
elementType: O O O O N C C C C C C C C C C C C C C C C H H H H H H H H H H H H H H H
charge: -0.313053 -0.434536 -0.296438 -0.232295 -0.411352 0.066868 0.366625 0.219401 0.093210 -0.462262 -0.379642 -0.338276 0.504439 -0.815631 -0.395334 -0.386545 0.138965 -0.224519 -0.232614 -0.229951 -0.134401 0.215038 0.229120 0.242712 0.279568 0.268487 0.230263 0.233272 0.380941 0.227371 0.252821 0.228342 0.235082 0.232251 0.251082 0.390990
chargesum: 0.00000
title: Mulliken charges with hydrogens summed into heavy atoms:
elementType: O O O O N C C C C C C C C C C C C C C C C
charge: -0.313053 -0.043546 -0.296438 -0.232295 -0.030411 0.066868 0.366625 0.219401 0.093210 -0.018104 -0.136929 -0.058708 0.504439 -0.083609 -0.167962 -0.133724 0.138965 0.003824 0.002468 0.002300 0.116681
polarizability: 2.81518989e+02 8.94949112e+00 2.38583545e+02 2.04390845e+01 3.60773305e-01 9.13274867e+01
1716.lowfreq: -3.9633 -0.0008 -0.0005 -0.0005 5.8178 8.2460 21.9833 25.3418 36.5508
frequency: 21.9021 25.2914 36.5475 58.8435 68.9534 80.6587 104.1244 115.6068 117.9162 137.1155 179.2195 198.4555 222.2231 257.8595 282.8056 312.9083 339.4786 343.0012 352.3800 360.0171 366.7304 403.5159 440.3043 479.4985 536.9015 538.5784 568.7886 576.0592 591.5391 602.1551 616.8504 629.4855 698.7811 706.7145 719.4054 726.3231 758.5829 771.4251 826.1710 834.4338 852.7820 856.9541 916.1083 921.5787 934.8334 959.3251 968.7004 976.8037 980.4558 991.0203 1000.3856 1006.5543 1026.6502 1045.4572 1050.0864 1064.9386 1091.9238 1162.3477 1174.1029 1174.6320 1178.0117 1190.1140 1191.9775 1229.2181 1236.6319 1286.4411 1324.0451 1329.3857 1350.0671 1362.4946 1374.6541 1386.2729 1393.5979 1422.9756 1439.9819 1441.6938 1467.2002 1476.1199 1485.1232 1487.1757 1494.3421 1569.6693 1594.9675 1595.9693 1604.2563 1616.4718 1640.2391 2978.0964 2983.2893 3043.0787 3059.6729 3061.7507 3107.2520 3119.3043 3127.5757 3137.3050 3143.0378 3150.5697 3166.6879 3184.1497 3254.6818 3530.7758
redmass: 5.0689 4.7899 5.7991 4.1773 7.8101 5.5364 2.6909 2.1942 1.8480 6.7156 4.1178 5.0839 3.3621 4.6204 4.7015 2.7390 3.3563 5.5587 5.4632 6.9009 5.4653 2.8237 6.9267 3.7206 4.1401 3.0540 4.7737 3.8206 3.5197 1.8319 6.3442 4.9089 4.2458 2.0215 5.4593 4.9409 2.3066 4.1429 5.0400 1.5349 3.0625 1.3429 3.3338 1.5970 1.5225 1.6013 1.9769 1.3400 1.3910 5.9882 1.3367 1.4259 2.1904 1.5552 2.7597 2.7030 1.5252 3.9627 1.1292 1.3153 2.8120 1.0987 1.1176 2.5277 2.2568 2.5762 2.5692 1.2690 1.2840 1.4494 4.9149 8.4350 1.2508 3.3175 2.2658 2.1994 1.2133 1.1612 1.2480 2.3794 2.0454 4.5028 6.8032 6.5047 6.6464 6.1180 3.2351 1.0417 1.0559 1.1089 1.0920 1.0919 1.0998 1.0874 1.0870 1.0917 1.0901 1.0961 1.1015 1.0950 1.0787 1.0641
irintensity: 0.5605 0.5603 1.7749 2.0795 0.3213 0.1412 0.0942 1.2126 1.2241 1.6196 2.6417 3.4388 2.2759 2.7131 1.1301 4.9921 5.5348 4.3723 10.5856 8.4258 9.3525 0.0824 22.8041 13.4210 16.8305 15.1691 18.0115 5.5304 28.5980 101.5162 0.0215 34.2222 18.7785 26.2224 37.9600 28.1808 85.5724 1.4056 45.5653 17.6973 14.2305 2.4703 127.0252 194.3763 1.8273 1.6446 8.4453 0.8844 0.8379 0.0554 1.6797 27.0937 3.7673 14.8283 96.3520 215.8473 8.0360 104.5762 9.0465 21.6860 273.7499 5.1050 2.1511 12.7087 26.1179 24.0663 186.6104 0.9794 16.1512 50.1117 8.7343 0.4957 18.3050 158.1087 3.2666 7.5804 18.5621 16.9710 6.1887 7.7448 100.6016 8.8280 306.7029 118.0200 291.0857 0.7786 141.0662 15.3257 36.0748 18.8947 17.8601 19.4377 8.0080 7.4243 0.9178 12.7547 10.0393 30.4013 22.9579 2.3293 187.1352 72.7880
temp: 298.150 k
press: 1.00000 atm
elementType: 8 8 8 8 7 6 6 6 6 6 6 6 6 6 6 6 6 6 6 6 6 1 1 1 1 1 1 1 1 1 1 1 1 1 1 1
symmnumber: 1
zpe: 726010.7 jmol-1
zpe.correction: 0.276523 hartree
zpe.thermalcorrener: 0.295896 hartree
zpe.thermalcorrenthalpy: 0.296840 hartree
zpe.thermalcorrgfe: 0.226519 hartree
zpe.sumelectzpe: -972.863569 hartree
zpe.sumelectthermal: -972.844196 hartree
zpe.sumelectthermalent: -972.843252 hartree
zpe.sumelectthermalfe: -972.913573 hartree
dipole: 0.1179 5.5974 1.5355
dipole: 5.8054
quadrupole: -97.3675 -128.0974 -125.8380
quadrupole: 0.7672 1.7404 -1.9513
quadrupole: 19.7335 -10.9964 -8.7371 0.7672 1.7404 -1.9513
hfenergy: -973.1400916 hartree
pointgroup: C01 [X(C16H15N1O4)]
dipole: -0.0998309 2.2130281 -0.5561109 debye
polarizability: 281.3055264|-8.2349903|238.0282143|23.2502842|3.3898302|92.0962794 unknown
InChI: InChI=1S/C16H15NO4/c1-11-7-8-13(16(19)20)14(17-10-18)15(11)21-9-12-5-3-2-4-6-12/h2-8,10,17,19H,9H2,1H3
charge 0 multiplicity 1
36 atoms
O  0.623361 0.554774 0.452606
O  -5.374275 -0.499416 -0.485805
O  -3.826957 -2.212823 -0.532717
O  0.073423 -3.429533 0.553872
N  -1.283541 -1.601003 0.092087
C  -0.75814 0.832823 0.271033
C  -1.184327 2.183269 0.30954
C  -1.681643 -0.247777 0.093921
C  -3.068272 0.081447 -0.124118
C  1.399858 0.482402 -0.84522
C  -2.565627 2.47113 0.139447
C  -3.483945 1.440405 -0.092798
C  2.843282 0.208382 -0.50808
C  -0.179797 3.296963 0.52404
C  3.743272 1.282379 -0.292387
C  3.314785 -1.123763 -0.384788
C  -4.063172 -0.975345 -0.386745
C  5.092074 1.032819 0.043333
C  4.663144 -1.37588 -0.048671
C  5.554352 -0.298561 0.16573
C  -0.131965 -2.188344 0.636815
H  1.275099 1.450141 -1.367709
H  0.958112 -0.322702 -1.463855
H  -2.905131 3.51151 0.179953
H  -4.543055 1.658963 -0.248714
H  0.717011 2.922749 1.043407
H  0.144848 3.731808 -0.441925
H  -0.624804 4.116605 1.114158
H  -2.015356 -2.262204 -0.237688
H  3.384348 2.314917 -0.386482
H  2.628808 -1.96419 -0.546502
H  5.780365 1.869405 0.206917
H  5.016746 -2.408283 0.045168
H  6.600898 -0.49483 0.424471
H  0.550659 -1.482119 1.138745
H  -5.974235 -1.270519 -0.672536
