program: Gaussian 09
title: 000258592
version: EM64L-G09RevD.01
frameworkgroup: C1[X(C13H17N5O3S)]
method: RPBEPBE
basis: SDD
operation: Freq
keyword: #p
keyword: freq=noraman
keyword: PBEPBE/SDD
title: #p freq=noraman PBEPBE/SDD
converged: YES YES NO NO
title: Mulliken charges:
elementType: S O O O N N N N N C C C C C C C C C C C C C H H H H H H H H H H H H H H H H H
charge: 0.202587 -0.268048 -0.278741 -0.416901 -0.123766 -0.079912 -0.046032 -0.061687 -0.608880 -0.082523 -0.060539 -0.530427 -0.501016 0.341718 -0.284539 -0.685851 -0.681873 0.159005 -0.206814 -0.097856 0.165360 -0.360447 0.271342 0.232738 0.350910 0.319714 0.175061 0.237813 0.236060 0.222194 0.225470 0.251982 0.225774 0.224225 0.264020 0.344081 0.245758 0.344850 0.335192
chargesum: 0.00000
title: Mulliken charges with hydrogens summed into heavy atoms:
elementType: S O O O N N N N N C C C C C C C C C C C C C
charge: 0.202587 -0.268048 -0.278741 -0.072820 -0.123766 -0.079912 -0.046032 -0.061687 0.071162 0.188819 0.172199 -0.179517 -0.181303 0.341718 0.128335 -0.002128 0.020109 0.159005 0.057206 -0.097856 0.165360 -0.114689
polarizability: 2.64410497e+02 7.92772126e+00 1.96818630e+02 2.61162107e+00 -2.27798998e+01 1.47495918e+02
1716.lowfreq: -28.4727 -13.1921 -8.9937 -0.0015 -0.0007 0.0017 9.7909 16.0184 36.9096
frequency: -23.0330 13.8936 36.8363 44.7404 62.8874 107.6556 118.8821 139.5841 162.7587 179.8373 186.2022 200.9771 220.3068 238.6026 242.1988 266.4288 276.4548 289.1189 341.5508 363.8425 370.4205 386.0805 445.9665 458.5388 474.0410 477.4675 509.4080 521.2476 548.0895 551.1208 561.1442 578.6971 594.8739 618.6342 640.5129 648.0964 667.6299 688.9891 710.9119 724.6256 743.0870 758.3491 786.2953 813.6085 826.7267 849.6229 868.3658 920.9881 930.9433 931.2428 950.8575 959.7860 977.1228 983.1680 998.4830 998.8233 1022.0644 1037.0520 1058.8114 1093.5732 1129.7069 1139.0682 1148.9104 1168.3410 1190.4527 1198.6541 1209.6179 1223.2422 1243.9462 1254.4522 1255.9791 1258.7292 1280.1530 1299.2239 1312.9865 1314.1179 1325.3999 1334.5506 1356.3626 1374.6494 1379.6613 1380.9652 1391.6829 1395.7252 1425.5880 1447.7763 1454.9393 1460.2005 1464.7541 1467.8827 1480.4051 1545.2690 1578.9902 1633.6116 2932.7159 2977.3935 2996.2192 3005.4828 3052.3730 3054.7917 3070.1376 3079.9760 3098.1551 3103.9983 3110.6789 3117.2264 3168.5970 3232.9154 3473.7926 3539.4436 3694.2533
redmass: 4.7753 5.5542 6.2374 4.5802 6.1176 5.4172 3.9547 5.2534 5.4046 1.1209 5.4233 6.4885 2.3412 1.4071 2.8432 4.3652 4.0071 3.6193 4.2812 3.2393 6.0613 3.2408 1.1530 3.7999 3.9790 5.4074 8.7257 1.2258 1.0548 4.2617 4.1109 5.0155 6.6300 5.0246 4.3345 4.6876 8.2219 6.7624 6.2759 6.6413 5.6496 4.1899 2.4579 2.7235 4.7378 8.3516 3.6269 1.5534 2.3229 1.5064 1.8867 2.4283 3.2715 1.4406 3.2182 4.0181 4.1623 3.0354 3.8226 2.4753 4.2756 1.9452 1.1319 1.3844 1.7948 1.6254 2.4966 2.2839 2.6421 1.5135 1.3600 2.8717 1.4405 4.7585 1.3738 3.9590 1.2881 1.3405 2.7048 1.2174 1.2975 3.0436 1.2710 1.3575 3.0934 1.0519 1.0586 2.6331 1.2432 1.0611 1.0571 8.5148 1.8795 2.6950 1.0682 1.0853 1.0352 1.0356 1.0875 1.0910 1.0851 1.0878 1.0999 1.1010 1.0999 1.1010 1.0922 1.0978 1.0652 1.0444 1.1056
irintensity: 1.3879 0.9631 1.1689 1.5881 1.0387 0.7997 1.6262 3.6051 9.0037 0.0708 0.3342 0.5647 3.1355 3.6152 2.4959 8.8752 1.9512 1.0093 1.5152 3.0391 0.5578 4.3169 115.7828 16.3426 9.5479 4.2800 2.2187 266.1026 0.0093 0.8259 4.0370 15.4375 7.0879 1.7068 7.9767 40.7100 7.4665 16.4188 21.8098 43.1145 31.5409 35.8568 18.8717 0.9295 23.8426 12.4673 11.8608 0.5410 29.6776 4.3943 51.6254 11.9853 27.2316 6.3826 115.7548 76.5372 14.7091 2.8511 19.1544 3.2739 8.9457 42.3609 34.0723 94.2360 8.8517 15.4500 82.5784 92.5499 33.6433 30.1829 59.9996 48.4685 7.0299 66.2875 6.5493 41.4794 6.8300 8.0494 114.8336 46.4116 40.9583 16.0189 47.6450 4.4604 82.0744 1.4101 2.8195 17.4183 15.7193 6.6239 10.8356 72.4936 41.8723 643.3844 75.8729 37.7604 9.0354 12.6146 18.8152 22.5703 13.9065 8.3149 14.3479 5.9470 23.4911 21.3383 15.4138 0.2740 7.0244 137.3678 49.8712
temp: 298.150 k
press: 1.00000 atm
elementType: 16 8 8 8 7 7 7 7 7 6 6 6 6 6 6 6 6 6 6 6 6 6 1 1 1 1 1 1 1 1 1 1 1 1 1 1 1 1 1
symmnumber: 1
zpe: 792001.9 jmol-1
zpe.correction: 0.301658 hartree
zpe.thermalcorrener: 0.321243 hartree
zpe.thermalcorrenthalpy: 0.322188 hartree
zpe.thermalcorrgfe: 0.252765 hartree
zpe.sumelectzpe: -1401.425138 hartree
zpe.sumelectthermal: -1401.405553 hartree
zpe.sumelectthermalent: -1401.404608 hartree
zpe.sumelectthermalfe: -1401.474031 hartree
dipole: 0.5209 -0.4363 -2.3385
dipole: 2.4352
quadrupole: -122.7207 -148.0603 -137.6463
quadrupole: -11.9642 0.9601 -5.2318
quadrupole: 13.4217 -11.9179 -1.5039 -11.9642 0.9601 -5.2318
hfenergy: -1401.7267959 hartree
pointgroup: C01 [X(C13H17N5O3S1)]
dipole: 0.1901474 -0.1241001 -0.9307841 debye
polarizability: 265.3161329|-0.5432495|199.1627152|0.762726|-18.9150687|144.2461969 unknown
InChI: InChI=1S/C13H17N5O3S/c1-13(2)20-8-6(3-19)22-12(9(8)21-13)18-5-17-7-10(14)15-4-16-11(7)18/h4-6,8-9,12,19H,3,14H2,1-2H3
charge 0 multiplicity 1
39 atoms
S  1.39297 0.824486 1.642923
O  1.827116 -1.794347 -1.143022
O  3.759525 -0.86981 -0.13096
O  2.372176 3.736293 0.970223
N  -0.761796 0.400303 -0.148761
N  -2.352838 1.805731 -1.031456
N  -2.255002 -1.309947 0.860791
N  -4.63286 -0.796709 0.492761
N  -5.371234 1.112613 -0.687298
C  1.532936 -0.380201 -0.902362
C  2.923341 0.254079 -0.590145
C  0.513191 -0.176378 0.26737
C  2.83712 1.332551 0.497675
C  3.055301 -2.163193 -0.377363
C  2.626612 2.752066 -0.071782
C  3.905991 -3.049516 -1.284526
C  2.702818 -2.797198 0.973469
C  -2.009563 -0.163824 0.168615
C  -1.038276 1.582956 -0.861698
C  -2.973165 0.715012 -0.389762
C  -4.340884 0.354859 -0.202267
C  -3.597187 -1.549382 0.975649
H  1.094519 -0.001116 -1.841335
H  3.378307 0.672699 -1.511202
H  0.261314 -1.15331 0.711139
H  3.740407 1.308431 1.128808
H  1.811236 2.74912 -0.829806
H  3.553198 3.092713 -0.566977
H  4.124362 -2.525896 -2.229194
H  4.856612 -3.298114 -0.783486
H  3.368173 -3.986072 -1.511455
H  2.174009 -2.075041 1.61798
H  2.070727 -3.688626 0.820741
H  3.627664 -3.100809 1.493471
H  -0.254199 2.24599 -1.218899
H  1.59277 3.419601 1.503477
H  -3.881744 -2.45388 1.520928
H  -5.17563 1.969515 -1.200415
H  -6.328115 0.807652 -0.520852
