program: Gaussian 09
title: 000258552
version: EM64L-G09RevD.01
frameworkgroup: C1[X(C12H21NO2)]
method: RPBEPBE
basis: SDD
operation: Freq
keyword: #p
keyword: freq=noraman
keyword: PBEPBE/SDD
title: #p freq=noraman PBEPBE/SDD
converged: YES YES NO NO
title: Mulliken charges:
elementType: O O N C C C C C C C C C C C C H H H H H H H H H H H H H H H H H H H H H
charge: -0.457425 -0.246197 -0.086390 -0.149991 -0.189280 -0.076442 -0.508104 -0.164247 -0.478516 -0.474557 -0.471180 -0.337040 -0.334510 -0.329761 -0.321484 0.241792 0.237519 0.265714 0.224133 0.238869 0.194459 0.220425 0.221253 0.205565 0.225850 0.204876 0.204138 0.329348 0.214667 0.194440 0.189726 0.205410 0.214133 0.189767 0.191033 0.212006
chargesum: 0.00000
title: Mulliken charges with hydrogens summed into heavy atoms:
elementType: O O N C C C C C C C C C C C C
charge: -0.128076 -0.246197 -0.086390 0.091801 0.048239 0.189272 -0.045103 0.030213 -0.036838 -0.043142 -0.062166 0.072067 0.060626 0.074139 0.081556
polarizability: 1.54882690e+02 -2.84266842e+00 1.27248922e+02 8.96146378e-01 3.21931145e+00 1.21061407e+02
1716.lowfreq: -12.2591 -0.0003 0.0006 0.0007 6.1395 12.6209 33.4934 40.1923 67.6770
frequency: 33.4743 39.9725 67.6599 110.6398 141.0861 190.3801 230.2750 263.1723 278.7183 298.5354 321.1723 334.7115 344.6462 394.2626 402.3417 452.0099 465.3660 477.2381 537.6058 595.9702 619.8686 743.6438 749.4346 760.5057 797.5147 808.0103 811.5011 837.7650 883.4872 894.6765 900.0523 915.3363 931.0568 947.5033 964.7445 972.1877 998.2500 1000.6981 1026.5632 1027.6786 1046.1715 1051.5752 1062.0768 1080.4175 1093.7739 1104.8341 1114.4607 1130.0545 1134.3649 1145.5790 1166.1020 1181.7804 1189.0177 1192.2756 1216.3089 1233.0188 1238.1223 1255.8810 1261.6095 1267.3492 1283.2060 1284.3421 1291.7885 1296.6090 1312.0184 1315.7930 1326.7733 1334.9216 1342.7784 1364.5315 1370.2654 1382.5840 1389.2815 1440.7517 1446.2182 1449.3058 1455.8591 1466.1455 1467.4143 1478.1204 1494.4230 2839.8001 2855.1378 2867.0680 2949.0666 2951.4643 2955.2014 2991.7726 2994.6447 3008.7219 3011.9974 3013.0364 3020.1169 3043.0944 3043.4357 3052.1650 3073.9825 3078.4042 3080.4633 3081.8418 3082.0309 3552.1980
redmass: 3.6880 3.5102 3.3464 3.7845 3.4307 4.2425 1.8571 2.9905 2.0905 2.7517 1.2869 2.0935 2.9616 1.8788 2.7352 2.9901 2.7739 3.7647 2.9863 1.8759 3.6554 3.9119 3.1150 3.7517 1.5838 3.8125 2.2247 1.6053 2.4899 2.3498 2.3096 2.9368 2.5232 2.0403 1.9684 1.8920 1.6039 2.5015 2.0589 2.0918 1.9067 2.0700 1.8682 2.5386 2.0150 1.9735 1.4166 1.3040 1.7494 2.2541 1.9268 1.8221 1.1544 1.2887 1.3050 1.2460 1.5035 1.3807 1.3601 1.4221 1.4876 1.4086 1.3153 1.4141 1.4334 1.5028 1.3013 1.4159 1.2548 1.3964 1.2727 1.4197 1.4960 1.0829 1.0803 1.0961 1.0904 1.0988 1.0892 1.0889 1.0899 1.0709 1.0707 1.0689 1.0857 1.0665 1.0666 1.0605 1.0830 1.0601 1.0648 1.0871 1.0888 1.0927 1.0886 1.0964 1.1025 1.0962 1.0918 1.1033 1.1000 1.0658
irintensity: 0.0790 0.1438 0.2632 0.1747 4.8233 0.2801 2.6086 0.4150 8.7385 3.0263 120.0162 5.0851 23.9395 0.2575 6.0151 3.9154 1.2685 1.8401 5.0374 8.5339 5.6168 1.3940 3.2216 9.3074 1.3869 20.4457 19.7590 0.1770 3.5914 2.4616 11.5909 17.0203 1.7853 3.6026 12.1245 45.6723 16.7529 22.5029 9.8916 6.7911 5.4254 24.3393 9.2870 16.3435 17.9412 8.3752 24.4466 2.5925 34.3771 18.0464 1.4804 5.2511 2.0061 19.9593 4.5806 23.0214 0.3027 14.3155 10.9715 14.5329 7.5652 4.1265 2.9776 5.0119 13.3517 0.7435 8.8167 11.8248 6.5264 0.9727 2.4850 1.1812 9.0525 2.4094 0.7831 18.9273 3.1786 6.9632 15.1353 8.6305 9.6719 43.0591 48.7233 165.4872 55.9137 30.0598 103.8625 42.9388 0.8462 39.3768 38.9781 25.4792 73.8728 55.4083 32.2863 32.9411 44.3509 42.6792 36.4674 80.1921 2.0558 2.9521
temp: 298.150 k
press: 1.00000 atm
elementType: 8 8 7 6 6 6 6 6 6 6 6 6 6 6 6 1 1 1 1 1 1 1 1 1 1 1 1 1 1 1 1 1 1 1 1 1
symmnumber: 1
zpe: 833039.1 jmol-1
zpe.correction: 0.317288 hartree
zpe.thermalcorrener: 0.331174 hartree
zpe.thermalcorrenthalpy: 0.332118 hartree
zpe.thermalcorrgfe: 0.276123 hartree
zpe.sumelectzpe: -673.824858 hartree
zpe.sumelectthermal: -673.810972 hartree
zpe.sumelectthermalent: -673.810028 hartree
zpe.sumelectthermalfe: -673.866023 hartree
dipole: -2.7011 -1.1751 -1.0867
dipole: 3.1397
quadrupole: -97.7960 -93.4428 -87.5237
quadrupole: -1.7819 1.7452 1.0598
quadrupole: -4.8752 -0.5220 5.3972 -1.7819 1.7452 1.0598
hfenergy: -674.1421456 hartree
pointgroup: C01 [X(C12H21N1O2)]
dipole: 1.0689669 0.4280938 -0.4471267 debye
polarizability: 154.7871111|-3.3039534|127.06766|-0.8592767|-3.4479269|121.3382478 unknown
InChI: InChI=1S/C12H21NO2/c14-12-10-2-1-9(7-10)11(12)8-13-3-5-15-6-4-13/h9-12,14H,1-8H2
charge 0 multiplicity 1
36 atoms
O  2.598237 -2.308432 -0.45119
O  -4.343953 -0.062286 0.306257
N  -1.493106 0.053628 -0.279274
C  1.307767 0.57712 1.008532
C  3.293013 0.086692 -0.001553
C  0.935812 -0.578783 0.022773
C  2.733106 0.129492 1.449515
C  2.291879 -0.883618 -0.694057
C  1.629082 1.87951 0.218753
C  2.97355 1.524171 -0.518462
C  -0.224802 -0.319076 -0.954614
C  -2.071579 -1.04824 0.532907
C  -2.506225 0.553448 -1.245004
C  -3.336355 -0.560444 1.257515
C  -3.762518 1.026777 -0.496564
H  0.564907 0.719597 1.808698
H  4.349461 -0.209661 -0.123547
H  0.716549 -1.483728 0.621928
H  3.244072 0.867893 2.093217
H  2.750052 -0.860305 1.938849
H  2.249924 -0.693922 -1.789152
H  1.772447 2.720396 0.9215
H  0.816532 2.167536 -0.469355
H  2.874752 1.552233 -1.620505
H  3.780216 2.226969 -0.243536
H  -0.353622 -1.227222 -1.600256
H  0.040413 0.515361 -1.633176
H  3.460866 -2.528626 -0.887122
H  -1.333799 -1.37967 1.285576
H  -2.328617 -1.931426 -0.106247
H  -2.798263 -0.239333 -1.980357
H  -2.074188 1.401099 -1.811163
H  -3.827448 -1.385257 1.800069
H  -3.064148 0.248253 1.97011
H  -3.499543 1.880336 0.165341
H  -4.555875 1.33112 -1.199402
