program: Gaussian 09
title: 000258551
version: EM64L-G09RevD.01
frameworkgroup: C1[X(C11H21NO3)]
method: RPBEPBE
basis: SDD
operation: Freq
keyword: #p
keyword: freq=noraman
keyword: PBEPBE/SDD
title: #p freq=noraman PBEPBE/SDD
converged: YES YES NO NO
title: Mulliken charges:
elementType: O O O N C C C C C C C C C C C H H H H H H H H H H H H H H H H H H H H H
charge: -0.256758 -0.256233 -0.219928 -0.110324 -0.368405 -0.327768 -0.336853 -0.313895 -0.670893 -0.669187 -0.514541 -0.496379 0.256605 0.240626 -0.766056 0.218412 0.232805 0.191647 0.207192 0.192148 0.227404 0.231194 0.241927 0.207857 0.227392 0.209471 0.208972 0.225171 0.206333 0.280225 0.254160 0.237860 0.275593 0.257848 0.240367 0.236013
chargesum: 0.00000
title: Mulliken charges with hydrogens summed into heavy atoms:
elementType: O O O N C C C C C C C C C C C
charge: -0.256758 -0.256233 -0.219928 -0.110324 0.082811 0.071071 0.082699 0.159225 -0.026173 -0.028712 0.019844 0.017074 0.256605 0.240626 -0.031827
polarizability: 1.76442577e+02 3.74939874e+00 1.32237955e+02 -2.04361557e+00 2.09575620e+00 1.08259950e+02
1716.lowfreq: -6.3043 -4.4206 -0.0009 -0.0003 0.0005 8.1353 18.7539 21.4482 25.9970
frequency: 18.5222 21.2417 25.9269 47.3205 60.9634 65.6666 73.5958 85.8205 96.1716 105.3888 137.1512 169.1597 198.8623 224.6805 246.3081 270.9190 276.7045 300.7791 326.7552 372.3036 398.0185 437.6829 457.7235 470.6436 522.5423 548.1485 592.3331 656.0609 744.9477 761.3531 777.0140 792.9498 796.3249 813.3212 870.7188 912.0120 925.8218 930.8435 971.2997 989.2890 1053.0484 1054.1919 1068.5924 1075.7103 1078.1290 1083.5949 1084.7457 1125.9631 1133.8004 1165.3851 1181.4012 1183.6017 1207.3238 1239.5196 1250.2334 1281.3188 1291.7496 1299.3091 1308.8133 1329.8792 1357.6372 1364.0860 1369.0059 1370.7424 1383.8917 1385.9103 1388.5956 1436.3735 1443.2018 1446.5692 1448.6778 1456.5048 1461.5598 1463.3491 1472.0704 1480.1978 1484.5135 1487.7084 1491.8291 1628.5961 1636.8397 2859.2146 2869.6421 2913.6435 2969.6287 2981.2817 2981.8392 2983.1647 2991.6396 3028.2336 3029.9401 3034.2504 3039.7155 3053.4886 3066.9368 3074.2479 3075.6340 3076.1001 3090.6199 3091.0915 3122.0415 3129.2665
redmass: 3.9575 3.8648 4.5040 3.9646 4.4669 2.7500 2.3295 2.1866 2.5047 1.1740 2.4508 1.5534 1.4810 2.6208 2.3060 2.0798 2.7360 2.5073 3.8287 2.9482 2.9172 2.6999 2.3891 2.3756 3.6736 3.4821 4.0383 3.7026 2.6076 1.5109 1.8978 1.1543 1.2518 1.7892 3.3723 2.2459 2.0108 2.1961 2.3137 2.2314 2.9877 2.0037 1.8378 2.5117 2.2115 3.1931 2.1118 1.7281 2.5608 1.4953 1.8265 1.8991 2.2440 1.2623 1.4196 1.1411 1.1828 1.2034 1.5031 1.3528 1.7665 1.3656 1.2548 1.3376 1.3353 1.2470 1.2666 1.0870 1.0678 1.1034 1.0771 1.0589 1.0523 1.0549 1.0526 1.0465 1.0733 1.0720 1.0810 8.8536 7.5471 1.0720 1.0714 1.0698 1.0625 1.0392 1.0357 1.0357 1.0658 1.0880 1.0940 1.0880 1.0617 1.0884 1.0949 1.0984 1.0944 1.0979 1.1003 1.1003 1.1005 1.1077
irintensity: 0.8127 0.3779 4.1753 2.0237 2.9953 0.3059 0.2306 0.5716 1.4358 1.0372 5.1804 7.6299 0.0844 0.2039 10.8647 2.7784 5.2377 4.8886 9.4634 7.1436 13.9564 7.7646 9.4303 3.4064 5.1350 14.5815 2.3448 2.9069 6.8110 6.9472 6.6861 6.4355 8.7323 0.9687 9.7266 10.0343 16.8012 57.6304 18.6857 4.5567 14.2615 3.2371 37.0481 16.4931 58.5463 3.9557 3.9006 3.9349 288.1062 81.3880 9.3506 3.8629 33.4296 113.2390 24.2500 3.7622 17.7117 13.6233 124.3502 24.6793 7.0595 11.1664 62.3817 6.2216 9.6730 19.6351 17.2732 14.0130 26.5990 42.1370 22.7168 15.4517 5.9429 2.2025 1.0937 4.1491 15.4684 12.7490 9.4171 181.0002 55.6294 47.9544 138.5548 73.1217 19.7188 6.3722 32.5082 28.9952 34.9555 6.8926 10.0092 17.5873 24.0681 21.2329 11.0495 33.0630 11.9491 81.1335 29.0780 54.0845 13.4409 15.0803
temp: 298.150 k
press: 1.00000 atm
elementType: 8 8 8 7 6 6 6 6 6 6 6 6 6 6 6 1 1 1 1 1 1 1 1 1 1 1 1 1 1 1 1 1 1 1 1 1
symmnumber: 1
zpe: 806935.5 jmol-1
zpe.correction: 0.307346 hartree
zpe.thermalcorrener: 0.326346 hartree
zpe.thermalcorrenthalpy: 0.327290 hartree
zpe.thermalcorrgfe: 0.256097 hartree
zpe.sumelectzpe: -710.955772 hartree
zpe.sumelectthermal: -710.936772 hartree
zpe.sumelectthermalent: -710.935828 hartree
zpe.sumelectthermalfe: -711.007020 hartree
dipole: -0.4600 1.1007 1.1317
dipole: 1.6443
quadrupole: -80.2461 -96.6221 -93.2801
quadrupole: 11.3065 11.6069 -1.8780
quadrupole: 9.8034 -6.5727 -3.2307 11.3065 11.6069 -1.8780
hfenergy: -711.2631177 hartree
pointgroup: C01 [X(C11H21N1O3)]
dipole: -0.1765481 -0.4724298 -0.4051383 debye
polarizability: 176.0461013|-4.361086|132.5681229|4.7186355|-0.5679968|108.3262573 unknown
InChI: InChI=1S/C11H21NO3/c1-4-12(5-2)8-9-15-11(14)7-6-10(3)13/h4-9H2,1-3H3
charge 0 multiplicity 1
36 atoms
O  0.140651 0.736973 -1.075543
O  0.733947 -1.212133 0.063224
O  4.727956 1.208321 1.172043
N  -3.407166 0.097441 0.089538
C  -2.044071 0.676557 0.13151
C  -4.463577 1.003332 0.61057
C  -3.462243 -1.277387 0.661764
C  -1.276759 0.261295 -1.137868
C  -4.795047 2.154586 -0.358125
C  -4.589625 -2.13564 0.057417
C  2.417052 0.552102 -0.349567
C  3.535783 -0.479685 -0.132256
C  1.045511 -0.09362 -0.414948
C  4.763643 0.098495 0.575728
C  6.02907 -0.748093 0.533084
H  -2.107004 1.778197 0.168194
H  -1.473117 0.34978 1.03118
H  -4.189276 1.418531 1.613261
H  -5.375804 0.398433 0.761762
H  -3.565386 -1.245246 1.775629
H  -2.491877 -1.767071 0.456898
H  -1.279745 -0.835598 -1.258916
H  -1.695524 0.7474 -2.031264
H  -5.596739 2.7928 0.058315
H  -5.131684 1.748633 -1.327917
H  -3.918054 2.801083 -0.545219
H  -4.573593 -3.152764 0.491649
H  -4.462492 -2.214729 -1.036351
H  -5.588517 -1.704776 0.253084
H  2.429589 1.266061 0.499237
H  2.578585 1.160662 -1.255097
H  3.847295 -0.957701 -1.080839
H  3.144583 -1.30757 0.497223
H  6.741505 -0.41283 1.302714
H  6.508646 -0.639199 -0.459745
H  5.800884 -1.821037 0.666327
