program: Gaussian 09
title: 000258625
version: EM64L-G09RevD.01
frameworkgroup: C1[X(C19H19N2O3P)]
method: RPBEPBE
basis: SDD
operation: Freq
keyword: #p
keyword: freq=noraman
keyword: PBEPBE/SDD
title: #p freq=noraman PBEPBE/SDD
converged: YES YES NO NO
title: Mulliken charges:
elementType: P O O O N N C C C C C C C C C C C C C C C C C C C H H H H H H H H H H H H H H H H H H H
charge: 1.312453 -0.519696 -0.520557 -0.594987 -0.759167 -0.072876 0.349115 0.344629 0.445640 0.446143 -0.324580 -0.324382 -0.357662 -0.355237 0.232307 -0.382462 -0.376919 -0.351004 -0.352492 -0.804458 -0.804374 -0.279230 -0.183663 -0.333252 -0.186749 0.369621 0.289735 0.285076 0.246864 0.247627 0.234018 0.234522 0.233579 0.233697 0.225960 0.226086 0.236318 0.225939 0.226500 0.236656 0.286090 0.239826 0.241839 0.233510
chargesum: 0.00000
title: Mulliken charges with hydrogens summed into heavy atoms:
elementType: P O O O N N C C C C C C C C C C C C C C C C C C C
charge: 1.312453 -0.519696 -0.520557 -0.594987 -0.389546 -0.072876 0.349115 0.344629 0.445640 0.446143 -0.034845 -0.039306 -0.110798 -0.107610 0.232307 -0.148444 -0.142397 -0.117425 -0.118796 -0.116094 -0.115279 0.006859 0.056163 -0.091413 0.046761
polarizability: 3.27378178e+02 -1.29168966e+00 2.54268985e+02 7.16905373e-01 -3.62793706e+01 1.81523163e+02
1716.lowfreq: -15.4609 -2.3035 -0.0019 -0.0017 -0.0015 5.9578 7.5318 14.2733 14.8985
frequency: -13.8699 14.2476 14.8925 16.6779 18.9460 40.4884 47.4729 53.9955 59.1703 96.8867 105.4089 123.4600 133.3017 159.4507 190.0388 224.1470 231.7664 246.5373 275.4594 292.1722 323.7535 332.2637 364.6547 373.9079 406.1644 409.4316 411.4358 414.7388 443.3804 466.2959 486.6278 503.6895 519.3468 523.8473 577.9978 601.3146 605.8307 627.0424 630.8861 640.8130 650.5066 707.6353 708.5618 741.6970 757.7230 775.0819 784.7518 786.0524 823.4680 826.2590 830.9437 833.4829 834.3237 843.6510 882.4260 909.6277 947.6273 948.2775 952.7303 956.1547 968.6933 969.0465 985.8415 987.5963 993.1378 1008.8124 1010.2696 1040.7143 1044.0488 1047.5467 1047.9866 1090.5063 1116.4594 1117.7965 1154.3596 1166.0237 1171.9424 1189.8326 1195.3514 1221.8887 1222.4840 1237.4836 1301.9514 1303.2371 1306.2289 1332.6977 1369.1426 1369.9295 1379.6445 1398.6587 1398.6696 1406.9344 1408.3202 1428.7440 1464.1078 1472.6958 1472.8592 1473.8930 1475.9779 1492.2145 1495.6694 1570.0760 1589.3488 1590.6235 1592.0503 1615.0658 1616.6838 2975.9719 2976.5407 3056.5186 3057.5171 3086.0893 3086.2240 3127.8115 3128.3452 3131.3384 3131.7005 3136.1793 3144.9344 3159.8408 3165.4728 3168.4006 3168.7865 3169.4778 3179.2348 3513.6250
redmass: 3.7772 5.3229 5.0178 1.1512 2.9387 4.0977 4.2517 1.0884 4.7933 5.9798 5.3365 5.0457 5.1090 5.6585 6.1153 6.3672 7.6045 6.4219 5.4939 4.9434 3.5639 4.4238 3.9830 3.9875 3.8842 3.5491 2.9334 4.6153 9.6249 4.5652 3.6898 2.2121 3.7582 3.4244 7.7334 1.9488 7.5988 6.9045 3.4148 7.0588 3.9404 3.2000 3.1590 1.9245 5.1888 4.6092 2.2466 5.8359 1.4429 1.4846 4.3623 1.3864 1.2920 6.7148 1.3453 4.9991 1.3216 1.3405 1.4251 6.3285 1.3703 1.3636 1.4071 1.4108 1.3276 2.9996 2.8927 6.1485 2.6646 1.5601 1.5624 1.6307 1.2766 1.2817 2.6083 2.0223 1.0986 1.2445 1.4338 3.4617 3.7082 1.7150 1.3777 1.4304 1.4648 5.4620 5.9978 6.1374 1.6574 1.2290 1.2283 3.1378 3.1320 2.1921 2.3019 1.0768 1.0630 1.0846 1.0702 2.5488 2.5756 5.5966 5.8414 6.7066 6.6737 6.3772 6.3655 1.0385 1.0386 1.0954 1.0954 1.0995 1.0997 1.0897 1.0897 1.0895 1.0898 1.0882 1.0905 1.0962 1.0953 1.0957 1.0954 1.0955 1.1012 1.0751
irintensity: 0.1218 0.1632 0.9804 0.3530 0.3542 1.0255 1.1862 0.2311 0.5409 1.3808 2.4832 3.2052 1.0122 0.5111 0.0209 14.5028 7.0722 0.8329 9.7159 2.7728 1.2331 1.3251 13.7145 2.4309 1.8089 16.0653 0.3101 22.2909 107.5941 12.1743 49.3171 18.8329 21.6086 29.4250 4.8074 4.7479 7.8236 4.3511 54.3087 4.2505 65.7944 1.4191 0.5952 12.0162 2.1392 129.9318 165.8155 35.4630 29.9957 104.1036 429.9475 62.7623 16.8998 17.1104 19.2383 138.3946 1.8857 9.3042 4.0122 35.3514 0.9909 1.6853 0.1811 0.1575 2.5458 45.2819 0.4576 84.9627 0.8340 20.6642 15.6163 8.8650 8.9754 25.2850 390.9870 15.5968 4.2664 93.9432 15.7723 9.1690 1.8641 1.6462 29.2612 43.0921 46.1650 18.9435 0.9209 0.0417 107.5418 18.6945 2.5331 0.5987 0.8652 47.8534 238.5061 16.0343 11.3182 14.5626 12.8415 335.0938 15.1785 19.1708 181.8287 4.8199 1.0611 18.3076 7.9743 45.4251 36.2592 23.2618 21.5078 16.6207 17.6490 16.4384 17.1313 21.2149 18.4963 11.8133 13.7117 1.9490 3.6732 11.6444 5.3072 2.8440 13.5789 70.3850
temp: 298.150 k
press: 1.00000 atm
elementType: 15 8 8 8 7 7 6 6 6 6 6 6 6 6 6 6 6 6 6 6 6 6 6 6 6 1 1 1 1 1 1 1 1 1 1 1 1 1 1 1 1 1 1 1
symmnumber: 1
zpe: 887546.4 jmol-1
zpe.correction: 0.338049 hartree
zpe.thermalcorrener: 0.361515 hartree
zpe.thermalcorrenthalpy: 0.362459 hartree
zpe.thermalcorrgfe: 0.279789 hartree
zpe.sumelectzpe: -1410.039365 hartree
zpe.sumelectthermal: -1410.015898 hartree
zpe.sumelectthermalent: -1410.014954 hartree
zpe.sumelectthermalfe: -1410.097625 hartree
dipole: 0.0402 3.1001 -0.8292
dipole: 3.2094
quadrupole: -120.8186 -144.3291 -155.7218
quadrupole: -0.5612 -0.1524 -10.0107
quadrupole: 19.4712 -4.0393 -15.4319 -0.5612 -0.1524 -10.0107
hfenergy: -1410.3774132 hartree
pointgroup: C01 [X(C19H19N2O3P1)]
dipole: 0.0218992 -1.1693955 0.4757677 debye
polarizability: 327.3545151|1.0713178|244.1573348|-1.7317286|-44.1675765|191.6584758 unknown
InChI: InChI=1S/C19H19N2O3P/c1-15-6-10-17(11-7-15)23-25(22,21-19-5-3-4-14-20-19)24-18-12-8-16(2)9-13-18/h3-14,21H,1-2H3
charge 0 multiplicity 1
44 atoms
P  0.011693 0.84138 -0.452324
O  -1.23251 0.884024 0.754483
O  1.262585 0.860962 0.749528
O  0.020958 1.953613 -1.585952
N  -0.006685 -0.746732 -1.146839
N  -0.028199 -3.05514 -1.383108
C  -2.617021 0.935775 0.38768
C  2.642522 0.91764 0.364486
C  -5.40284 1.036143 -0.117117
C  5.416708 1.01758 -0.194017
C  -3.096878 1.736618 -0.670563
C  3.127233 1.881289 -0.545163
C  -3.495394 0.19196 1.201195
C  3.508589 0.003401 0.997207
C  -0.01741 -2.007712 -0.508005
C  -4.488518 1.771203 -0.913335
C  4.512784 1.914244 -0.819033
C  -4.881516 0.254179 0.947327
C  4.890162 0.064467 0.717157
C  -6.894678 1.066514 -0.402045
C  6.908837 1.088757 -0.469629
C  -0.01729 -2.170372 0.904447
C  -0.029475 -3.484832 1.410781
C  -0.039477 -4.316495 -0.866437
C  -0.040688 -4.58563 0.519408
H  -0.005952 -0.797176 -2.171726
H  -2.403863 2.322609 -1.283084
H  2.438988 2.580967 -1.02972
H  -3.088714 -0.412319 2.017561
H  3.096892 -0.73504 1.691805
H  -4.866601 2.391367 -1.734646
H  4.895117 2.656923 -1.529191
H  -5.567172 -0.318062 1.583655
H  5.567279 -0.643778 1.209495
H  -7.485402 1.064615 0.531516
H  -7.178063 1.961743 -0.982174
H  -7.207047 0.180587 -0.988415
H  7.367491 0.083881 -0.480504
H  7.119192 1.568942 -1.440942
H  7.430253 1.67799 0.309681
H  -0.009434 -1.303795 1.570711
H  -0.030653 -3.647426 2.493913
H  -0.04805 -5.128518 -1.601986
H  -0.050553 -5.616646 0.883822
