program: Gaussian 09
title: 000258577
version: EM64L-G09RevD.01
frameworkgroup: C1[X(C15H16Cl2N6)]
method: RPBEPBE
basis: SDD
operation: Freq
keyword: #p
keyword: freq=noraman
keyword: PBEPBE/SDD
title: #p freq=noraman PBEPBE/SDD
converged: YES YES NO NO
title: Mulliken charges:
elementType: Cl Cl N N N N N N C C C C C C C C C C C C C C C H H H H H H H H H H H H H H H H
charge: -0.049026 -0.052875 -0.167365 -0.453373 -0.030544 0.015348 -0.057086 -0.631305 0.451558 -0.390373 -0.392088 0.383698 -0.364735 -0.382862 0.074793 -0.406077 -0.395401 0.123800 -0.584674 -0.585514 -0.106026 0.127412 -0.400283 0.253724 0.250137 0.249690 0.252325 0.238015 0.234300 0.286938 0.192475 0.301731 0.295124 0.268348 0.292279 0.271372 0.244121 0.339004 0.303420
chargesum: 0.00000
title: Mulliken charges with hydrogens summed into heavy atoms:
elementType: Cl Cl N N N N N N C C C C C C C C C C C C C C C
charge: -0.049026 -0.052875 -0.167365 -0.151643 -0.030544 0.015348 -0.057086 0.011119 0.451558 0.113487 0.109927 0.383698 -0.126721 -0.148562 0.074793 -0.119140 -0.202926 0.123800 -0.021202 -0.021864 -0.106026 0.127412 -0.156161
polarizability: 4.55379413e+02 3.17752777e-01 2.42190514e+02 4.54603638e-01 2.61612621e+01 1.12023032e+02
1716.lowfreq: -0.0018 0.0014 0.0015 1.9460 3.1820 8.0903 18.3438 25.8123 29.7965
frequency: 18.3415 25.8015 29.7824 32.1489 59.7194 62.1562 74.8289 104.3323 132.9751 134.8251 141.8339 176.7970 211.3931 217.1678 231.3351 243.2236 262.5839 266.5085 290.8114 305.6159 344.9492 396.5557 408.6343 415.5326 435.9777 510.2534 518.4778 518.8601 536.5046 556.6097 565.4524 571.4499 575.5699 610.1206 634.9007 651.1469 673.6476 697.6722 704.2385 727.7600 748.1013 773.6835 785.6731 790.8201 791.7999 800.5164 836.1146 849.7416 919.9913 928.7549 929.0322 952.8392 956.1040 989.5260 994.7697 999.7126 1034.7360 1035.2630 1041.1069 1074.3206 1100.7177 1120.2498 1142.4044 1182.7875 1197.5654 1214.6909 1221.4409 1256.3978 1259.3406 1269.2368 1279.1301 1281.8066 1291.3515 1293.6475 1319.7475 1333.8508 1338.4926 1354.5925 1356.8147 1375.5751 1377.7079 1390.8260 1424.1722 1444.1064 1461.0415 1461.7833 1473.9585 1485.2930 1505.2298 1514.8234 1549.6685 1573.5738 1598.9676 1629.2582 1634.4988 3017.3959 3022.2853 3063.7283 3063.9906 3073.2163 3078.7984 3110.4971 3147.9131 3148.4683 3151.7249 3160.9933 3162.0886 3171.5308 3547.6079 3595.9560 3705.7909
redmass: 6.7940 8.9359 15.0063 12.3634 5.0339 4.3526 6.0596 2.9385 2.6810 3.6262 3.4800 8.6891 4.5174 4.4197 4.5648 4.3720 2.1722 5.1764 3.1742 3.3868 4.6831 5.1827 2.9213 4.6163 2.9060 1.7626 3.3034 1.7930 3.6523 1.3342 4.1966 5.0206 4.7439 7.5084 7.0180 9.1253 6.7954 5.3790 5.4577 5.2195 4.1848 5.8406 1.1244 5.7415 1.2937 1.4180 1.5886 9.3484 8.8725 1.4191 1.4125 2.8884 2.1264 1.3502 3.2268 1.4241 3.3125 2.4380 2.3514 2.8134 4.4687 1.5505 1.4434 1.6354 2.5362 1.2174 1.8964 1.1632 1.1587 2.5267 1.3839 3.8864 5.1167 1.2109 2.1316 3.6997 2.2379 1.2599 1.4233 5.7362 2.9094 1.8226 2.1115 3.3840 1.1045 1.1164 3.0993 1.0999 1.1295 5.2775 5.6276 5.5532 1.7010 3.8773 4.1151 1.0602 1.0609 1.0573 1.0581 1.1028 1.1037 1.0887 1.1111 1.1113 1.0884 1.0930 1.0918 1.0963 1.0457 1.0809 1.1036
irintensity: 6.6965 2.4478 1.6259 0.8419 0.6703 0.5052 3.1057 1.5922 1.8237 2.6251 0.1185 1.1165 2.6776 1.7607 9.1388 14.6692 61.5563 2.3625 58.4533 14.3674 2.1671 14.5016 2.1627 6.2761 1.5882 53.1022 31.1343 74.6765 31.0299 102.2772 4.7616 1.6358 4.7132 2.8524 2.9019 19.5632 82.5450 44.7387 41.9617 12.3007 13.1746 0.0436 3.4284 2.3843 11.3872 22.4976 49.7208 18.0403 4.5545 8.9377 4.4302 35.1285 23.3421 1.4551 0.9784 3.9793 0.4458 0.1567 0.5779 9.8124 22.2334 35.7187 9.5141 101.9396 3.2117 60.6467 36.1838 17.7494 16.0718 13.4006 73.8361 3.2237 12.3340 12.1551 54.3431 95.4896 62.8564 2.1133 106.6240 15.5680 44.7754 47.5422 11.7898 8.8106 21.0609 21.8611 736.1080 28.6437 35.9419 75.5660 27.5636 1.7016 35.9961 764.1670 226.5141 22.9681 23.9123 5.2202 24.4073 9.7489 8.2000 26.4630 2.4191 22.8038 10.1061 21.7442 27.0865 13.9703 111.9958 19.0119 26.5448
temp: 298.150 k
press: 1.00000 atm
elementType: 17 17 7 7 7 7 7 7 6 6 6 6 6 6 6 6 6 6 6 6 6 6 6 1 1 1 1 1 1 1 1 1 1 1 1 1 1 1 1
symmnumber: 1
zpe: 785024.4 jmol-1
zpe.correction: 0.299000 hartree
zpe.thermalcorrener: 0.320418 hartree
zpe.thermalcorrenthalpy: 0.321362 hartree
zpe.thermalcorrgfe: 0.244899 hartree
zpe.sumelectzpe: -1828.183734 hartree
zpe.sumelectthermal: -1828.162317 hartree
zpe.sumelectthermalent: -1828.161373 hartree
zpe.sumelectthermalfe: -1828.237835 hartree
dipole: -3.3515 6.9367 1.7620
dipole: 7.9029
quadrupole: -172.5581 -157.7606 -149.9467
quadrupole: 31.6596 8.2717 3.0898
quadrupole: -12.4696 2.3278 10.1417 31.6596 8.2717 3.0898
hfenergy: -1828.4827345 hartree
pointgroup: C01 [X(C15H16Cl2N6)]
dipole: 1.3417461 2.7241635 -0.6678137 debye
polarizability: 455.3080868|-2.9579725|242.9653879|-3.6068503|-24.2081985|111.3194837 unknown
InChI: InChI=1S/C15H16Cl2N6/c16-5-7-23(8-6-17)11-3-1-10(2-4-11)14-21-12-13(18)19-9-20-15(12)22-14/h1-4,9,21H,5-8,18H2
charge 0 multiplicity 1
39 atoms
Cl 6.030491 -3.564311 -0.284751
Cl 5.798237 3.792282 0.224797
N  4.014752 0.051334 0.009268
N  -2.596331 0.944026 -0.136851
N  -2.4267 -1.274187 0.395609
N  -4.856007 -1.740732 0.539319
N  -6.286298 0.2092 0.093121
N  -5.482447 2.350733 -0.431801
C  2.605731 0.018551 0.030623
C  4.818173 -1.127888 0.381458
C  4.748519 1.265179 -0.389953
C  -0.276368 -0.050611 0.075014
C  1.89319 -1.177689 0.364845
C  1.829709 1.178775 -0.281837
C  -1.735764 -0.14297 0.11426
C  0.492848 -1.204954 0.387172
C  0.425554 1.137035 -0.261365
C  -3.910095 0.472787 -0.006008
C  4.992442 -2.079838 -0.817823
C  4.909522 2.228221 0.802411
C  -3.77958 -0.917619 0.326764
C  -5.210598 1.031014 -0.120276
C  -6.051286 -1.107408 0.404997
H  4.359292 -1.666828 1.228582
H  5.813416 -0.793168 0.72312
H  4.239002 1.778459 -1.224419
H  5.748322 0.979202 -0.760908
H  2.430364 -2.099027 0.606498
H  2.314876 2.123894 -0.541302
H  -0.043002 -2.124513 0.642695
H  -0.113148 2.059251 -0.514709
H  -2.300774 1.891679 -0.360146
H  4.036599 -2.489666 -1.173833
H  5.541964 -1.609202 -1.646729
H  3.943254 2.560532 1.207704
H  5.535274 1.803118 1.601109
H  -6.946269 -1.716325 0.56451
H  -6.462844 2.622417 -0.481652
H  -4.759422 3.039847 -0.612109
