program: Gaussian 09
title: 000258545
version: EM64L-G09RevD.01
frameworkgroup: C1[X(C9H13NO2S)]
method: RPBEPBE
basis: SDD
operation: Freq
keyword: #p
keyword: freq=noraman
keyword: PBEPBE/SDD
title: #p freq=noraman PBEPBE/SDD
converged: YES YES NO NO
title: Mulliken charges:
elementType: S O O N C C C C C C C C C H H H H H H H H H H H H H
charge: 0.906172 -0.533249 -0.533187 -0.721828 -0.355728 0.508636 0.509543 0.500502 -0.604501 -0.604280 -0.791946 -0.793118 -0.807732 0.245771 0.245773 0.233295 0.284033 0.217340 0.284609 0.233458 0.217576 0.228866 0.228848 0.242648 0.329280 0.329220
chargesum: 0.00000
title: Mulliken charges with hydrogens summed into heavy atoms:
elementType: S O O N C C C C C C C C C
charge: 0.906172 -0.533249 -0.533187 -0.063328 -0.355728 0.508636 0.509543 0.500502 -0.358730 -0.358507 -0.057279 -0.057475 -0.107369
polarizability: 1.76256690e+02 -2.52961769e-02 1.48528058e+02 3.11801431e+00 3.08246286e-02 8.71441638e+01
1716.lowfreq: -87.3778 -10.8353 -3.6017 0.0006 0.0018 0.0022 8.5673 30.3151 49.2078
frequency: -87.3755 30.1817 49.1369 59.0340 148.6204 158.0738 172.6749 187.3813 195.6964 223.4338 232.6020 237.6642 289.5446 293.8003 294.4391 327.6269 368.3620 418.6096 480.0020 506.5341 522.6175 533.5426 541.7499 565.7652 578.9848 728.5613 798.9157 817.9267 869.7184 896.1832 898.6115 931.5077 942.4116 984.2795 1018.5347 1029.3108 1042.4582 1044.9831 1047.1777 1055.4481 1067.2275 1193.4394 1263.1595 1311.0601 1349.7796 1397.0853 1398.8597 1400.3889 1410.0376 1418.0876 1456.1938 1460.1869 1473.5101 1474.3004 1475.3487 1481.0735 1537.1463 1591.4591 1597.6040 2979.3570 2998.2297 2998.6997 3061.6724 3083.3514 3083.9129 3090.1697 3102.9383 3103.4123 3126.7156 3129.8235 3349.7595 3513.3355
redmass: 1.9607 1.0145 2.6003 3.8780 3.1534 1.4424 1.5059 2.1374 3.5195 2.2370 5.1605 3.0579 2.9357 7.3165 2.9632 2.9458 5.5721 7.3017 5.3775 3.1173 3.7767 3.6184 4.7133 3.5338 4.0627 3.1232 4.1702 1.9109 1.3065 1.5047 2.8555 2.7606 3.1665 6.9462 1.6295 1.6882 1.4989 1.5411 1.5168 1.6552 1.5524 1.4442 1.4468 7.3693 5.5674 1.7563 1.3437 1.7982 1.3133 1.5904 1.0659 1.0859 1.0566 1.0937 1.1454 1.1632 1.0853 7.2304 5.2043 1.0386 1.0373 1.0372 1.0950 1.0971 1.0971 1.1001 1.0999 1.0999 1.0911 1.0921 1.0416 1.0989
irintensity: 19.7869 0.8231 20.6180 1.0406 6.4790 0.0445 0.6254 0.6217 0.9560 0.6061 5.8904 4.5712 0.1362 1.8595 2.4913 4.2074 0.7802 79.2355 143.2937 0.0004 0.6284 0.2433 6.6880 14.4609 19.0519 1.6888 14.6490 180.5638 16.7456 16.0372 56.4193 0.1684 0.3490 1.0217 0.9527 5.1764 2.6127 4.0735 1.6875 35.3042 21.9395 0.0714 1.6728 7.8112 5.3766 0.0378 28.8651 14.8200 5.5477 10.3309 20.5827 29.7786 14.4666 0.6686 40.7875 29.6088 30.4888 19.2378 18.9910 26.5318 29.5877 7.7058 19.0017 9.3162 24.5792 15.6608 13.7017 7.3959 20.7022 12.4923 19.9963 18.8277
temp: 298.150 k
press: 1.00000 atm
elementType: 16 8 8 7 6 6 6 6 6 6 6 6 6 1 1 1 1 1 1 1 1 1 1 1 1 1
symmnumber: 1
zpe: 531736.7 jmol-1
zpe.correction: 0.202528 hartree
zpe.thermalcorrener: 0.217086 hartree
zpe.thermalcorrenthalpy: 0.218030 hartree
zpe.thermalcorrgfe: 0.160871 hartree
zpe.sumelectzpe: -952.856190 hartree
zpe.sumelectthermal: -952.841631 hartree
zpe.sumelectthermalent: -952.840687 hartree
zpe.sumelectthermalfe: -952.897847 hartree
dipole: -3.7522 -0.0149 2.7543
dipole: 4.6547
quadrupole: -79.5579 -81.3197 -90.4282
quadrupole: -0.0858 11.8734 -0.0005
quadrupole: 4.2107 2.4489 -6.6596 -0.0858 11.8734 -0.0005
hfenergy: -953.0587175 hartree
pointgroup: C01 [X(C9H13N1O2S1)]
dipole: -1.4895023 -0.0034115 1.0653543 debye
dipolederiv: 1.8895307 -0.0016974 0.2422558 -0.0020363 1.2906252 -0.0017608 0.264661 -0.0014676 1.4832437 -0.7213383 0.0794507 0.0183181 0.0522172 -0.6600647 -0.1542109 -0.0274414 -0.041617 -0.5297914 -0.7208506 -0.0800697 0.0177579 -0.0517818 -0.6627411 0.154022 -0.0281278 0.0398913 -0.5274655 -0.689626 0.0006195 -0.108555 0.002005 -0.3455261 0.0032412 -0.2114821 0.0047838 -0.8749664 0.0556706 -0.0002795 0.0029285 -0.0002312 -0.2739289 -0.0001773 0.1235628 -0.0002988 -0.2237869 -0.0196737 0.2688594 0.0076471 -0.1399205 0.2127623 0.011796 -0.009019 0.0145758 0.0365242 -0.0193023 -0.2680828 0.0083617 0.138512 0.2117649 -0.0126046 -0.008741 -0.0155775 0.0367634 0.5376235 0.0002305 0.026351 0.0001925 0.1684608 -0.0001608 0.1088404 -0.0001144 0.0223203 -0.285121 -0.2546289 -0.0085042 -0.0822206 -0.0997459 -0.0060705 -0.0266317 -0.0089004 -0.1891466 -0.2858796 0.2544419 -0.0091443 0.0822057 -0.0989768 0.005978 -0.0268389 0.0088401 -0.1891927 -0.00572 -0.1754043 -0.0022467 -0.1168502 -0.086014 0.0225422 0.0355636 0.0402854 0.0059922 -0.0070337 0.1751475 -0.0028284 0.1169462 -0.0862941 -0.0224193 0.0358131 -0.0400161 0.0058329 -0.1894594 -0.0002175 -0.0223083 -0.0009273 0.0742103 -0.0000149 -0.1428553 -0.0001548 0.0475917 -0.0012676 0.0717633 0.0025053 0.0890272 -0.0571401 -0.0024626 0.0071615 -0.0140013 0.1471409 -0.001054 -0.0715785 0.0026548 -0.0889194 -0.0572299 0.0029541 0.0073428 0.0145735 0.147098 0.0180853 -0.0417413 -0.1065869 -0.0047556 0.0505934 0.0282112 -0.1142269 -0.0163852 -0.0218278 0.097931 -0.0673634 0.0681437 -0.02787 0.0833514 -0.0095013 0.0566471 0.0161259 0.012851 -0.0481357 0.1969065 0.0214688 0.0665395 -0.0323856 -0.0197132 0.0166553 -0.045128 0.1079214 0.0983079 0.067724 0.0680814 0.0283843 0.0840492 0.0097725 0.0560877 -0.0167656 0.013618 0.0171919 0.0410796 -0.1067302 0.0047187 0.050604 -0.0285325 -0.1143759 0.016538 -0.0215276 -0.0474515 -0.1963196 0.0219482 -0.0664429 -0.032331 0.0202422 0.0166876 0.0457841 0.107942 0.0245391 -0.0218802 0.0193826 -0.1045642 -0.0591777 0.0954719 0.0799658 0.077138 0.0650953 0.0246119 0.0220242 0.0192592 0.1052934 -0.0601216 -0.0947217 0.0793882 -0.0764047 0.0660621 -0.0221491 -0.0001764 -0.0494849 -0.0002304 0.1120071 -0.000709 -0.0936977 -0.0006423 -0.0886336 0.1498716 0.0739835 -0.0640062 0.039415 0.1384408 -0.0825726 -0.0424251 -0.0580076 0.1788391 0.1506992 -0.0727909 -0.0666691 -0.0387063 0.1348079 0.0814007 -0.0425141 0.0569455 0.1815021 unknown
polarizability: 176.1661629|-0.0369085|148.5280567|4.2163639|-0.0590201|87.2346921 unknown
InChI: InChI=1S/C9H13NO2S/c1-6-4-7(2)9(8(3)5-6)13(10,11)12/h4-5H,10H2,1-3H3
charge 0 multiplicity 1
26 atoms
S  2.180923 0.001062 -0.139341
O  2.729597 -1.39477 -0.771989
O  2.732592 1.40445 -0.752316
N  2.671276 -0.012924 1.651699
C  0.263609 0.00194 -0.045947
C  -0.402649 1.25659 -0.008159
C  -0.401526 -1.253205 -0.005426
C  -2.545938 0.000505 -0.007474
C  -1.820365 1.212887 0.003139
C  -1.819187 -1.211198 0.005741
C  0.269052 2.618215 0.043912
C  0.272499 -2.613439 0.051024
C  -4.062756 -0.00026 -0.038004
H  -2.363516 2.16518 0.028763
H  -2.361317 -2.164012 0.03364
H  0.997174 2.688381 0.871311
H  0.833612 2.834235 -0.877486
H  -0.494378 3.400115 0.191511
H  0.837527 -2.831278 -0.869651
H  1.000366 -2.679197 0.879109
H  -0.489346 -3.396344 0.201312
H  -4.478697 -0.893167 0.460143
H  -4.479502 0.895207 0.454816
H  -4.433052 -0.003574 -1.081489
H  3.230075 -0.870571 1.806389
H  3.223228 0.846172 1.822069
