program: Gaussian 09
title: 000258544
version: EM64L-G09RevD.01
frameworkgroup: C1[X(C8H20N2)]
method: RPBEPBE
basis: SDD
operation: Freq
keyword: #pfreq=noraman
keyword: PBEPBE/SDD
title: #p freq=noraman PBEPBE/SDD
converged: YES YES NO NO
title: Mulliken charges:
elementType: N N C C C C C C C C H H H H H H H H H H H H H H H H H H H H
charge: -0.077241 -0.570598 -0.368915 -0.390708 -0.369575 -0.354261 -0.357663 -0.394394 -0.625678 -0.615484 0.186577 0.193090 0.211920 0.199893 0.186315 0.191012 0.171847 0.209261 0.218305 0.179781 0.206819 0.177098 0.234828 0.182022 0.217996 0.183749 0.224844 0.220012 0.257855 0.271293
chargesum: 0.00000
title: Mulliken charges with hydrogens summed into heavy atoms:
elementType: N N C C C C C C C C
charge: -0.077241 -0.041450 0.010751 0.021105 0.007752 0.026848 0.040422 -0.010477 0.009168 0.013120
polarizability: 1.31231511e+02 -3.97019955e-01 9.18912507e+01 -2.49485901e-01 -1.69119366e+00 8.50260439e+01
1716.lowfreq: -20.3579 -0.0007 -0.0003 0.0005 3.3813 14.6450 33.5567 46.3931 59.7117
frequency: 31.2957 45.5329 59.6064 89.9729 96.2127 137.3421 148.8145 158.9264 215.3250 228.7235 240.5738 246.0821 293.5730 335.9077 400.1393 415.6930 475.3242 507.8815 605.8530 730.5334 751.5292 796.7611 811.3341 876.6565 945.2150 984.1438 995.5544 1030.6827 1036.1240 1041.3925 1074.2684 1078.9835 1089.5234 1097.4215 1110.4067 1121.4776 1151.9037 1186.6670 1220.2982 1223.4641 1259.9574 1263.4051 1276.3824 1280.4291 1292.1514 1300.1526 1301.3621 1337.2679 1357.9755 1374.8529 1388.7335 1416.8650 1440.2287 1458.3199 1459.9668 1463.8350 1464.4506 1471.9423 1475.1689 1477.8800 1483.3302 1488.0455 1493.1022 1637.5146 2811.5783 2834.8120 2852.8069 2859.4870 2951.5722 2954.2222 2961.0631 2975.2430 2990.3966 3000.6932 3006.4143 3013.8810 3015.2269 3028.2215 3041.7363 3050.8627 3074.5191 3087.3048 3449.1626 3576.9097
redmass: 2.9931 1.9729 3.6056 2.7550 1.7187 2.0909 2.0759 2.8537 2.4366 1.1446 1.1438 1.3714 2.4503 2.2466 2.5691 2.7734 2.8161 2.7987 1.2856 1.0696 1.1046 1.1986 4.0967 1.2338 1.9098 1.5002 2.7869 1.7125 2.5493 2.3383 2.2764 2.0151 1.6276 2.0473 1.6406 1.6627 1.7053 1.6540 1.7804 1.3691 2.0462 1.6096 1.2692 1.0451 1.0882 1.3048 1.2051 1.4132 1.6389 1.4175 1.4659 1.1442 1.1646 1.0665 1.0579 1.0802 1.0644 1.0700 1.0678 1.0683 1.0760 1.0767 1.0909 1.0942 1.0701 1.0579 1.0580 1.0716 1.0590 1.0619 1.0628 1.0610 1.0963 1.0852 1.0857 1.1005 1.0715 1.0714 1.1022 1.1033 1.1010 1.0999 1.0447 1.0974
irintensity: 0.3338 1.5457 0.2376 1.1230 2.1942 1.1351 0.3444 0.2719 5.5890 6.5420 25.8851 17.9401 5.6743 12.6875 0.6463 10.6373 9.6788 4.3738 222.7206 11.5508 0.5270 0.9872 20.0421 0.2978 0.3079 0.5896 5.3764 26.2589 18.5513 3.6636 4.7401 2.9904 0.6117 7.7281 28.9358 7.1068 5.2808 9.7137 4.3828 0.3532 1.7904 10.9182 1.3655 2.1584 0.5780 0.4177 8.2150 0.2602 0.2496 8.8476 17.9273 2.1198 3.3242 5.1268 17.6004 0.8090 0.0094 9.2431 7.4640 7.4422 5.9322 21.3621 8.3515 39.6838 72.3364 74.7324 234.8693 115.4018 1.3622 3.0098 73.4826 43.6161 4.9877 33.8177 42.7878 1.8752 44.2239 47.2560 3.6324 187.3226 39.4846 44.0243 2.2651 0.1449
temp: 298.150 k
press: 1.00000 atm
elementType: 7 7 6 6 6 6 6 6 6 6 1 1 1 1 1 1 1 1 1 1 1 1 1 1 1 1 1 1 1 1
symmnumber: 1
zpe: 719473.4 jmol-1
zpe.correction: 0.274033 hartree
zpe.thermalcorrener: 0.287945 hartree
zpe.thermalcorrenthalpy: 0.288889 hartree
zpe.thermalcorrgfe: 0.232492 hartree
zpe.sumelectzpe: -425.452494 hartree
zpe.sumelectthermal: -425.438582 hartree
zpe.sumelectthermalent: -425.437638 hartree
zpe.sumelectthermalfe: -425.494035 hartree
dipole: 0.2053 0.9006 1.4983
dipole: 1.7601
quadrupole: -59.5955 -66.1072 -65.9588
quadrupole: 6.3982 1.3110 -0.4377
quadrupole: 4.2917 -2.2201 -2.0716 6.3982 1.3110 -0.4377
hfenergy: -425.7265272 hartree
pointgroup: C01 [X(C8H20N2)]
dipole: 0.0864712 0.3672955 0.5806552 debye
polarizability: 131.2203324|-0.6645653|91.8163934|-0.5180719|-1.8422288|85.1120796 unknown
InChI: InChI=1S/C8H20N2/c1-10(2)8-6-4-3-5-7-9/h3-9H2,1-2H3
charge 0 multiplicity 1
30 atoms
N  -3.423698 0.066832 -0.248778
N  5.475383 -0.304207 0.118791
C  0.413182 -0.42436 0.189251
C  -0.901811 0.308955 -0.161134
C  1.676232 0.387666 -0.176394
C  -2.147738 -0.499808 0.25431
C  2.990054 -0.357636 0.147244
C  4.25069 0.457047 -0.206538
C  -3.740173 1.390967 0.323701
C  -4.545679 -0.878734 -0.075896
H  0.430779 -0.656979 1.275139
H  0.441932 -1.400221 -0.338637
H  -0.953674 0.492566 -1.252312
H  -0.9001 1.300384 0.334127
H  1.656413 1.357641 0.363869
H  1.650841 0.63373 -1.258605
H  -2.159501 -0.60849 1.373358
H  -2.056222 -1.522235 -0.163227
H  3.03244 -1.318507 -0.401031
H  3.010296 -0.609495 1.229706
H  4.253786 0.658043 -1.295696
H  4.186542 1.451903 0.302484
H  -2.949793 2.117303 0.071433
H  -3.852998 1.372109 1.439568
H  -4.687378 1.760685 -0.108539
H  -4.774913 -1.108755 0.997295
H  -4.311378 -1.830909 -0.585038
H  -5.459719 -0.461064 -0.535588
H  5.55078 -0.554249 1.110598
H  6.341925 0.11392 -0.233963
