program: Gaussian 09
title: 000258542
version: EM64L-G09RevD.01
frameworkgroup: C1[X(C8H10FNS)]
method: RPBEPBE
basis: SDD
operation: Freq
keyword: #p
keyword: freq=noraman
keyword: PBEPBE/SDD
title: #p freq=noraman PBEPBE/SDD
converged: YES YES NO NO
title: Mulliken charges:
elementType: S F N C C C C C C C C H H H H H H H H H H
charge: -0.043434 -0.218627 -0.407015 -0.301877 0.465247 -0.728468 -0.328742 -0.386941 -0.372636 -0.343796 0.302335 0.229375 0.226633 0.301080 0.270166 0.271497 0.236032 0.224362 0.246634 0.248609 0.109566
chargesum: 0.00000
title: Mulliken charges with hydrogens summed into heavy atoms:
elementType: S F N C C C C C C C C
charge: 0.066132 -0.218627 -0.105935 0.154131 0.465247 -0.186805 -0.092710 -0.162579 -0.126002 -0.095187 0.302335
polarizability: 1.61425472e+02 3.38228159e+00 1.06779328e+02 -6.03689201e+00 -1.98834906e+00 6.17856672e+01
1716.lowfreq: -14.5676 -10.2262 0.0010 0.0012 0.0031 1.4450 35.9723 59.4116 101.0411
frequency: 35.9588 59.3258 101.0379 138.3611 174.9502 192.7756 243.3632 337.3375 347.5875 364.9996 414.0730 431.9943 487.1721 504.7327 537.4503 617.7825 628.7716 699.0363 740.0011 790.0324 810.7441 812.3115 824.0080 890.7700 913.4123 929.1651 990.6341 996.3548 1036.7096 1105.3373 1132.8885 1153.4264 1188.8555 1197.6356 1227.7399 1289.8056 1296.3350 1308.2667 1357.9789 1379.2857 1417.5884 1443.8841 1479.4897 1484.9198 1513.6856 1597.0804 1630.4774 2444.4995 2916.7808 2980.0576 3040.6460 3117.5437 3128.4419 3151.4382 3170.2723 3174.4983 3514.8520
redmass: 6.9878 4.6367 5.2085 4.2988 6.1234 1.1027 2.2806 6.2377 5.9434 4.4367 3.0581 3.2257 1.3431 2.3899 3.7894 4.2691 6.9848 3.3723 3.8026 1.2769 2.3784 1.8439 1.2366 2.1199 1.3510 1.3355 2.2542 2.3335 1.5797 1.4022 2.4402 1.4788 1.2931 1.8505 1.2321 1.4456 1.2430 1.6976 2.0227 2.4612 3.9597 1.0958 1.6433 1.1022 2.9654 6.2886 6.6082 1.0386 1.0663 1.0928 1.0580 1.1092 1.0895 1.0875 1.0955 1.0968 1.0767
irintensity: 0.4315 1.4845 2.3894 1.8303 1.1296 18.8402 3.2503 4.3442 0.2202 5.3476 0.2777 11.6399 105.1313 9.6530 18.7567 3.5899 0.0985 0.7214 45.5124 1.9479 18.4164 91.7700 2.8556 1.4637 0.8741 0.0678 5.3361 18.1777 3.2783 9.1292 17.7343 17.0049 6.3477 66.2243 23.9488 6.5065 19.1254 16.5880 15.9842 29.8546 8.9160 15.6950 3.6873 95.5541 399.3678 0.2639 72.2249 32.8628 67.1369 20.7619 30.7681 16.3725 14.2025 16.4171 9.7043 1.8833 78.7847
temp: 298.150 k
press: 1.00000 atm
elementType: 16 9 7 6 6 6 6 6 6 6 6 1 1 1 1 1 1 1 1 1 1
symmnumber: 1
zpe: 424043.7 jmol-1
zpe.correction: 0.161510 hartree
zpe.thermalcorrener: 0.172674 hartree
zpe.thermalcorrenthalpy: 0.173618 hartree
zpe.thermalcorrgfe: 0.123413 hartree
zpe.sumelectzpe: -862.670672 hartree
zpe.sumelectthermal: -862.659508 hartree
zpe.sumelectthermalent: -862.658563 hartree
zpe.sumelectthermalfe: -862.708768 hartree
dipole: -4.6638 0.8247 1.5078
dipole: 4.9704
quadrupole: -78.8750 -63.9438 -76.5938
quadrupole: -1.8499 -6.2257 -1.9356
quadrupole: -5.7374 9.1937 -3.4563 -1.8499 -6.2257 -1.9356
hfenergy: -862.8321812 hartree
pointgroup: C01 [X(C8H10F1N1S1)]
dipole: -1.8670929 0.1925854 0.5485173 debye
dipolederiv: -0.1461692 0.0011104 -0.2107623 -0.0270979 -0.2660573 -0.0061104 -0.2154009 -0.0110234 -0.0068188 -1.2559401 -0.0342706 0.0502242 -0.0510568 -0.2065989 0.0086481 0.0638372 0.0063601 -0.1493483 -1.8082865 0.1051471 0.0458843 -0.0418515 -0.2482299 0.0691572 0.2899746 0.0609011 -0.4776714 0.4323621 -0.1790661 0.0690016 -0.6012853 0.3533609 -0.0875172 -0.0534661 -0.1228269 0.3333142 1.7404142 0.0183669 -0.0798193 0.2257824 -0.1318226 0.0039567 -0.1465922 0.0079521 0.1337432 0.1831793 0.1858877 0.1751903 0.1971525 0.3278642 0.1562001 0.1172768 0.11671 0.1393894 -0.3150045 0.1668206 -0.0148337 -0.4429413 0.0407297 -0.0202479 0.0402186 -0.0310819 -0.2411249 -0.3600185 -0.1397078 0.0098736 0.3509328 0.0830532 -0.0483343 -0.0231506 -0.0174226 -0.2167843 0.0139617 -0.1890904 0.0075608 0.1322879 0.0804052 -0.0225213 -0.0255144 -0.0119837 -0.133222 0.0167514 0.1575682 -0.0269597 -0.0982033 0.089351 -0.0143407 0.0013324 -0.0331855 -0.1309019 1.1493285 0.0599971 -0.056435 0.0440393 0.002512 -0.000517 -0.0649463 0.0024525 0.0235192 -0.015463 0.0028393 0.0252252 0.1788007 -0.0135881 0.0710879 -0.0619504 0.1405747 -0.1381623 -0.0048598 -0.1044212 -0.0622293 0.062676 -0.0715819 -0.0836044 0.0007417 -0.0900402 0.004358 0.2913666 0.0230593 0.0105774 0.1158117 0.098453 -0.0113462 -0.0565111 -0.0371241 0.2887923 -0.0544098 0.0503576 -0.0318871 0.0619226 -0.1136275 -0.0529059 -0.0477602 -0.0449655 0.0614847 0.0769048 -0.0429301 -0.0346299 -0.0963828 -0.005288 0.0091509 -0.0049262 -0.0081262 -0.1317953 0.0225524 0.1018894 -0.0030714 0.1128608 -0.0291524 0.0213394 -0.0029217 0.0126279 0.1631665 0.0180434 -0.1011713 0.0179101 -0.0768039 -0.0538651 0.0259807 0.0169547 0.0245003 0.1583287 0.0545858 -0.0633601 0.0120052 -0.0821121 -0.0213408 0.0227962 0.0153268 0.021472 0.1733617 0.0368769 0.0763549 -0.0012462 0.088132 -0.0052123 0.0128608 -0.0025359 0.0120759 0.1759418 -0.0761757 -0.0953808 0.0984211 -0.0526639 0.0906357 -0.0537326 0.1600132 0.0021534 -0.0295706 unknown
polarizability: 161.2582326|6.2574065|107.270496|-2.1302892|1.5878717|61.4617384 unknown
InChI: InChI=1S/C8H10FNS/c9-7-1-3-8(4-2-7)10-5-6-11/h1-4,10-11H,5-6H2
charge 0 multiplicity 1
21 atoms
S  -4.420677 -0.877678 -0.7550
F  4.131637 0.086042 -0.106203
N  -1.484508 -0.237603 0.245976
C  -2.387757 0.898013 0.071748
C  -0.092803 -0.134835 0.135771
C  -3.831981 0.512908 0.417927
C  0.562418 1.122951 -0.023696
C  0.708662 -1.315779 0.203285
C  1.970753 1.196815 -0.099764
C  2.111932 -1.246731 0.121324
C  2.720158 0.013421 -0.025794
H  -2.343157 1.313478 -0.961328
H  -2.092944 1.71893 0.757967
H  -1.907957 -1.162103 0.132373
H  -4.498375 1.379812 0.290723
H  -3.891716 0.137191 1.452321
H  -0.018145 2.047208 -0.095714
H  0.222749 -2.2912 0.325578
H  2.478981 2.1582 -0.221821
H  2.727522 -2.149832 0.172173
H  -5.495092 -1.283511 0.018555
