program: Gaussian 09
title: 000258531
version: EM64L-G09RevD.01
frameworkgroup: C1[X(C6H12O4)]
method: RPBEPBE
basis: SDD
operation: Freq
keyword: #pfreq=noraman
keyword: PBEPBE/SDD
title: #p freq=noraman PBEPBE/SDD
converged: YES YES NO NO
title: Mulliken charges:
elementType: O O O O C C C C C C H H H H H H H H H H H H
charge: -0.490976 -0.456085 -0.467946 -0.235577 -0.062354 -0.111194 -0.122886 -0.488993 -0.728044 -0.018774 0.206164 0.229641 0.232524 0.255491 0.287059 0.285860 0.231161 0.197074 0.368348 0.356664 0.345692 0.187151
chargesum: 0.00000
title: Mulliken charges with hydrogens summed into heavy atoms:
elementType: O O O O C C C C C C
charge: -0.122628 -0.099422 -0.122254 -0.235577 0.143810 0.118448 0.109639 0.053557 -0.013949 0.168377
polarizability: 8.42059542e+01 -4.44031991e+00 7.64288056e+01 -1.30243992e+00 4.40032433e+00 6.92512745e+01
1716.lowfreq: -7.9162 -0.0006 0.0008 0.0012 4.7921 12.0102 42.3434 70.6662 96.9351
frequency: 41.7834 70.6469 96.9292 132.2842 186.1458 219.2346 243.1643 282.9947 307.4236 312.7486 324.1605 351.9071 432.9127 439.8867 487.0271 540.6463 633.4337 634.5055 690.7128 794.4977 813.9496 860.4149 890.2354 937.1222 943.4287 1005.9958 1014.1029 1055.2856 1086.9089 1094.8699 1130.7274 1191.2802 1220.8949 1231.4667 1263.7795 1291.5083 1300.4291 1341.2166 1353.3997 1358.4914 1374.7885 1380.2283 1393.2145 1401.7964 1403.8305 1462.8465 1482.7258 1619.1847 2906.9176 2936.4107 2971.4044 2972.3561 3037.8881 3040.0471 3044.8838 3072.0530 3102.3944 3423.4061 3425.9784 3552.0698
redmass: 4.0683 5.9570 5.0102 2.5358 3.6844 4.5339 1.1148 3.3534 3.3807 2.2162 1.3246 4.0894 3.5464 5.2222 2.6343 5.1075 1.1001 1.0838 1.5790 3.1497 4.0774 2.9257 1.9865 2.1923 2.0841 6.1135 1.4762 2.2755 1.9393 2.4924 1.9966 1.3197 1.3049 1.4199 1.5305 1.2204 1.1980 1.5001 1.4267 1.1660 1.2386 1.2908 1.2163 1.1798 1.3306 1.0518 1.0493 6.5641 1.0861 1.0830 1.0630 1.0434 1.0863 1.0925 1.0868 1.0944 1.1002 1.0641 1.0653 1.0661
irintensity: 4.7005 3.9454 3.9592 6.7492 9.0053 7.7372 1.5214 5.1269 16.0882 28.0414 49.1312 13.4925 5.2656 23.8022 1.1716 12.5384 139.1687 193.9019 36.5488 13.9743 54.0023 8.7154 8.6962 12.7238 55.0338 56.8693 43.0280 67.2252 45.7050 24.8145 25.9325 12.7506 4.3080 8.0402 26.4007 20.3600 61.5127 18.7454 9.2185 25.4399 11.1772 53.2341 57.6727 47.4412 27.0742 13.4447 9.6506 80.2086 119.1629 31.0623 41.3493 18.1303 3.9251 2.7796 38.6239 50.7511 6.3675 64.7926 66.9743 5.9673
temp: 298.150 k
press: 1.00000 atm
elementType: 8 8 8 8 6 6 6 6 6 6 1 1 1 1 1 1 1 1 1 1 1 1
symmnumber: 1
zpe: 470210.0 jmol-1
zpe.correction: 0.179094 hartree
zpe.thermalcorrener: 0.190688 hartree
zpe.thermalcorrenthalpy: 0.191633 hartree
zpe.thermalcorrgfe: 0.141685 hartree
zpe.sumelectzpe: -535.876496 hartree
zpe.sumelectthermal: -535.864901 hartree
zpe.sumelectthermalent: -535.863957 hartree
zpe.sumelectthermalfe: -535.913904 hartree
dipole: 0.0234 -0.6817 0.3574
dipole: 0.7700
quadrupole: -56.2698 -66.1332 -59.7821
quadrupole: -7.6979 -7.6871 0.5252
quadrupole: 4.4586 -5.4049 0.9463 -7.6979 -7.6871 0.5252
hfenergy: -536.0555892 hartree
pointgroup: C01 [X(C6H12O4)]
dipole: -0.0485809 -0.1710104 0.2453081 debye
dipolederiv: -0.5373863 -0.0663899 0.0363165 -0.0841676 -0.482855 0.0629132 -0.0121911 0.0511038 -0.8181441 -0.7031469 0.1446824 -0.0495688 0.1209849 -0.3399951 0.0226603 -0.0027198 0.0335935 -0.7396471 -0.8697931 0.1422728 -0.0524983 0.1356304 -0.3495393 0.2705014 -0.0535252 0.2456141 -0.5509146 -0.5432677 -0.0409266 0.1082515 -0.1212638 -0.5902512 -0.225394 0.0976319 -0.234124 -0.6312141 0.104661 0.0960752 -0.0090102 0.0686773 0.222097 0.0619949 0.0853966 0.0371456 0.4436949 0.4423209 -0.0276623 0.0182437 -0.0839988 0.2951344 0.0471389 0.0801989 -0.0574835 0.5524238 0.5379508 -0.1447633 0.1187976 -0.1234921 0.3894625 -0.1480681 0.0540204 -0.1190118 0.3597064 -0.1921416 -0.1344239 0.0452506 -0.1854181 -0.2962016 -0.1925168 -0.0395073 -0.1252158 -0.1508249 -0.0575621 0.0672177 0.0455224 0.0527927 0.0491572 0.0212575 -0.0177177 0.0540064 -0.2184431 0.6915348 0.2803871 -0.1578924 0.2840917 0.6850272 0.3999435 -0.2273599 0.3212787 0.5992253 0.0184444 -0.0313534 -0.0145922 -0.0443333 -0.1367967 -0.0900607 -0.0199577 -0.0697049 -0.0715694 -0.0018457 -0.0968886 -0.0293352 -0.0609367 -0.0939559 -0.0463803 -0.02215 -0.0292958 0.0230409 0.0241498 0.0034775 -0.016819 -0.013971 -0.1266551 -0.0243403 -0.0297121 -0.0587761 0.009324 -0.0535042 0.0542452 -0.0444932 0.0927699 0.0090754 0.0165608 -0.0330998 0.0532457 0.1345137 0.1455688 -0.0665178 0.0295549 -0.043319 0.1315567 0.028319 0.0668801 0.0127509 -0.0021389 0.1635874 0.0295112 -0.0732909 0.0258041 0.0594764 0.0553222 -0.0630585 0.0474955 0.042379 -0.1694908 -0.0373191 0.0794026 -0.0325942 0.0928251 -0.0223624 0.0321157 -0.006956 0.0718626 0.0852248 -0.068315 0.0054946 -0.0256598 -0.1531875 -0.0666882 0.0090119 0.00149 0.0600648 0.3104016 0.0525591 -0.1074864 0.0819034 0.2932415 0.0235634 -0.0559916 0.0073796 0.3534638 0.4577824 -0.036113 -0.038275 0.0171361 0.190858 -0.0650599 -0.0277454 -0.0061539 0.3343362 0.3527297 -0.0370528 -0.0267054 0.0168926 0.1052331 -0.1169674 -0.0002276 -0.1642484 0.222031 -0.2062179 -0.0827025 0.1331324 -0.0775284 0.0462929 -0.0123368 0.1797084 0.0058665 -0.0231703 unknown
polarizability: 84.9342566|-2.189893|68.465924|-3.4690958|3.4740708|76.4858537 unknown
InChI: InChI=1S/C6H12O4/c1-4(8)6(10)5(9)2-3-7/h3-6,8-10H,2H2,1H3
charge 0 multiplicity 1
22 atoms
O  0.423377 -0.196297 1.851615
O  -0.394426 0.877601 -1.634998
O  2.898409 -0.745175 1.056735
O  -2.248937 -1.134817 -1.010766
C  0.604314 -0.195626 0.391236
C  -0.346963 0.897095 -0.165606
C  2.104121 0.068609 0.084642
C  -1.760781 0.78346 0.450012
C  2.525303 -0.220758 -1.357492
C  -2.564629 -0.404344 -0.030956
H  0.319366 -1.187962 -0.027206
H  0.072622 1.885363 0.094785
H  2.349026 1.107451 0.370663
H  -2.352541 1.693013 0.209325
H  -1.682986 0.738143 1.553178
H  1.935551 0.4002 -2.052408
H  3.599962 -0.009231 -1.496276
H  2.336891 -1.28155 -1.619938
H  1.281088 -0.554584 2.219334
H  -0.89196 0.048802 -1.88669
H  3.056874 -1.64159 0.663597
H  -3.505384 -0.614305 0.534813
