program: Gaussian 09
title: 000258516
version: EM64L-G09RevD.01
frameworkgroup: C1[X(C9H12Cl2N2O2S)]
method: RPBEPBE
basis: SDD
operation: Freq
keyword: #p
keyword: freq=noraman
keyword: PBEPBE/SDD
title: #p freq=noraman PBEPBE/SDD
converged: YES YES NO NO
title: Mulliken charges:
elementType: Cl Cl S O O N N C C C C C C C C C H H H H H H H H H H H H
charge: -0.029587 -0.064533 0.967058 -0.514462 -0.517902 -0.347176 -0.001185 -0.331938 -0.327493 0.023510 -0.565545 -0.578332 -0.188367 -0.330452 -0.169058 -0.300076 0.238776 0.294641 0.255624 0.253946 0.277019 0.258922 0.315100 0.283940 0.307082 0.283532 0.249851 0.257103
chargesum: 0.00000
title: Mulliken charges with hydrogens summed into heavy atoms:
elementType: Cl Cl S O O N N C C C C C C C C C
charge: -0.029587 -0.064533 0.967058 -0.514462 -0.517902 -0.347176 -0.001185 0.201480 0.182077 0.023510 -0.029604 0.020708 0.118716 -0.046920 0.080793 -0.042973
polarizability: 1.89255309e+02 -1.30770655e+01 1.54754568e+02 5.70470287e+00 1.24149815e+01 1.32105532e+02
1716.lowfreq: 0.0011 0.0022 0.0023 2.9369 7.4487 10.1809 22.6410 28.7435 42.1757
frequency: 22.3228 28.6512 42.0890 53.2747 70.1058 75.2635 116.5167 139.4489 150.5567 182.4149 198.6271 210.0916 227.3519 242.6873 261.0462 277.5125 320.3111 351.2177 377.7976 394.6657 431.4170 467.7923 489.8478 579.7403 594.5462 621.3237 681.7890 686.0477 706.0694 760.4704 793.6817 811.5135 820.1006 906.1921 913.3587 933.5519 944.6627 955.6695 968.6937 998.9245 1005.7737 1016.4161 1020.0627 1056.7993 1060.9929 1108.4903 1126.2210 1190.3654 1192.0683 1231.1134 1247.2968 1258.4528 1298.4172 1303.7175 1316.8684 1318.1440 1352.5886 1376.8840 1411.3078 1433.6936 1436.7673 1439.0186 1448.2943 1469.9807 1541.4505 1568.5345 2945.6779 2987.0094 3028.6512 3045.2713 3050.5547 3083.7165 3127.3689 3145.9828 3156.1830 3157.3930 3173.1190 3178.2086
redmass: 5.0960 8.5510 9.6362 12.2615 5.9283 9.5022 3.5686 4.3359 4.6675 3.9529 5.5304 4.2445 6.6176 9.4344 5.4912 3.8325 6.8894 2.4243 7.0195 3.7020 3.8138 7.2024 4.7957 5.1356 7.9336 4.0501 7.1210 6.2165 2.2941 1.2929 10.9470 2.2022 1.5218 2.1285 1.4090 9.5913 2.1519 1.4058 6.9743 1.3842 1.5570 4.1899 3.7094 2.0502 2.1896 1.5988 1.4196 1.3590 1.3127 2.7748 1.1868 1.1600 1.2111 9.1743 1.1579 1.2568 1.1892 1.2303 2.0441 1.7502 1.0788 1.0806 1.0851 1.0926 5.7060 6.7118 1.0656 1.0596 1.0919 1.1035 1.0600 1.0571 1.1100 1.0884 1.0925 1.0929 1.1119 1.1002
irintensity: 1.8229 1.6266 1.7894 0.3987 4.0215 0.8910 0.4194 0.7929 3.7891 6.1328 3.8395 5.3784 3.6722 8.6842 3.2123 15.0075 3.4561 5.3325 17.8337 10.5520 22.7002 56.8378 26.8926 95.9874 13.0274 15.5734 22.6810 85.0677 33.9166 23.8707 88.7541 20.8898 36.6597 19.5471 1.2889 70.3767 18.5911 0.2671 10.8255 0.3056 3.1341 6.3559 4.7282 8.3516 9.1160 7.5958 17.1207 3.2492 5.1227 48.4920 10.9528 9.1689 12.8683 6.2859 16.4303 9.3414 2.9505 1.4515 29.0286 17.7572 26.5184 10.4050 13.0215 17.9519 5.1045 5.7006 30.2328 11.4984 7.8305 7.7789 21.7550 8.0134 13.6898 9.2199 1.2561 2.8170 4.8588 16.7906
temp: 298.150 k
press: 1.00000 atm
elementType: 17 17 16 8 8 7 7 6 6 6 6 6 6 6 6 6 1 1 1 1 1 1 1 1 1 1 1 1
symmnumber: 1
zpe: 533033.3 jmol-1
zpe.correction: 0.203022 hartree
zpe.thermalcorrener: 0.220551 hartree
zpe.thermalcorrenthalpy: 0.221495 hartree
zpe.thermalcorrgfe: 0.154626 hartree
zpe.sumelectzpe: -1926.868440 hartree
zpe.sumelectthermal: -1926.850911 hartree
zpe.sumelectthermalent: -1926.849967 hartree
zpe.sumelectthermalfe: -1926.916836 hartree
dipole: -1.6584 1.8621 -3.6574
dipole: 4.4266
quadrupole: -107.8290 -130.0890 -118.0060
quadrupole: -13.7612 -15.3129 8.1199
quadrupole: 10.8123 -11.4476 0.6354 -13.7612 -15.3129 8.1199
hfenergy: -1927.0714619 hartree
pointgroup: C01 [X(C9H12Cl2N2O2S1)]
dipole: 0.6159781 -0.2629064 -1.6076104 debye
polarizability: 185.9792363|-13.6831619|163.314643|-10.3741783|-0.4667101|126.8215299 unknown
InChI: InChI=1S/C9H12Cl2N2O2S/c10-3-6-13(7-4-11)16(14,15)9-2-1-5-12-8-9/h1-2,5,8H,3-4,6-7H2
charge 0 multiplicity 1
28 atoms
Cl -3.646553 1.525137 1.103363
Cl -2.727638 -3.078718 -1.406596
S  0.046012 0.544727 0.910185
O  -0.492077 -0.607664 1.935822
O  0.225456 2.095322 1.368082
N  -0.936449 0.616425 -0.662006
N  3.749009 0.326694 -0.956841
C  -1.672184 1.864608 -0.899127
C  -1.325413 -0.68843 -1.226708
C  1.707603 -0.097161 0.252084
C  -3.192821 1.864746 -0.692616
C  -2.411199 -1.471473 -0.453629
C  2.088898 -1.40342 0.594592
C  2.534937 0.755256 -0.501615
C  3.348276 -1.842028 0.123077
C  4.132038 -0.949984 -0.645783
H  -1.488654 2.163593 -1.954813
H  -1.209716 2.638007 -0.255672
H  -0.424392 -1.326418 -1.310018
H  -1.668096 -0.496327 -2.262082
H  -3.60169 2.86114 -0.923186
H  -3.71386 1.10016 -1.289224
H  -2.07585 -1.765164 0.549882
H  -3.380187 -0.959474 -0.400245
H  1.435212 -2.028731 1.211746
H  2.245157 1.783418 -0.739814
H  3.713744 -2.847813 0.34952
H  5.111736 -1.254028 -1.029774
