program: Gaussian 09
title: 000258512
version: EM64L-G09RevD.01
frameworkgroup: C1[X(C9H12N6O)]
method: RPBEPBE
basis: SDD
operation: Freq
keyword: #p
keyword: freq=noraman
keyword: PBEPBE/SDD
title: #p freq=noraman PBEPBE/SDD
converged: YES YES NO NO
title: Mulliken charges:
elementType: O N N N N N N C C C C C C C C C H H H H H H H H H H H H
charge: -0.267261 -0.163330 -0.452550 -0.115412 -0.031450 -0.682563 -0.625615 -0.535250 0.112530 0.237927 0.329483 -0.268418 -0.024207 -0.745224 -0.352438 0.148989 0.286076 0.227386 0.273887 0.302459 0.257928 0.233609 0.252843 0.250420 0.380499 0.306922 0.307897 0.354866
chargesum: 0.00000
title: Mulliken charges with hydrogens summed into heavy atoms:
elementType: O N N N N N N C C C C C C C C C
charge: -0.267261 -0.163330 -0.150092 -0.115412 -0.031450 0.004858 0.037148 -0.021788 0.112530 0.237927 0.329483 0.005469 -0.024207 -0.000845 -0.102018 0.148989
polarizability: 1.73003217e+02 -6.72511599e+00 1.44360884e+02 -9.64275037e+00 -2.76358055e+00 1.00748336e+02
1716.lowfreq: -10.5459 0.0001 0.0004 0.0007 3.7486 16.0785 41.5775 49.5904 58.9098
frequency: 41.4708 49.4176 58.8075 86.4535 125.1463 176.5949 186.9536 203.7952 227.1501 238.2171 257.6628 274.0706 287.0419 307.4736 331.0474 378.7144 408.7092 496.2222 503.0162 522.2381 545.3869 562.5485 594.7051 618.0151 622.6185 641.3965 664.7143 677.9184 688.3793 719.9541 734.4487 766.1771 793.1409 833.8215 891.1380 912.7070 958.4116 975.0235 999.4092 1043.5516 1054.3673 1073.6534 1117.2163 1148.0765 1166.2447 1200.4092 1216.2923 1252.7744 1266.7037 1306.7411 1341.7084 1344.5009 1388.7639 1406.9479 1419.1455 1456.6097 1458.8809 1460.0333 1472.5434 1484.5034 1500.8093 1560.8795 1593.8677 1628.0199 1634.4550 1674.4649 2985.9911 2994.9463 3055.8512 3063.7757 3118.2086 3210.3354 3239.2356 3472.8219 3526.8727 3545.5991 3650.3110 3695.8484
redmass: 4.6786 5.1421 4.0809 5.1359 1.0937 5.6949 4.9567 5.0210 3.4980 1.3286 2.0104 1.5148 2.5066 4.0718 2.7164 4.1672 2.7750 2.1127 2.7423 2.6410 1.1873 1.2257 4.1841 5.9307 4.3408 7.7434 4.9729 4.3717 7.6430 5.9800 1.2287 5.6849 5.6901 1.3493 3.7069 2.9537 2.6376 1.6811 2.7716 1.4941 1.5029 1.5364 1.9627 2.9931 2.7097 4.3971 2.9045 3.3126 2.3164 1.6078 2.3284 1.6416 2.2825 1.2538 4.5393 1.2896 2.2613 4.3760 1.1084 1.4814 4.1552 7.4007 1.5088 1.3995 2.0392 4.8093 1.0402 1.0600 1.1021 1.0952 1.0986 1.0905 1.1078 1.0528 1.0770 1.0458 1.0988 1.1045
irintensity: 7.0729 0.4445 9.8324 2.9752 0.7390 5.8632 1.3911 5.7615 22.1866 93.0081 27.1526 3.9671 3.2957 2.3565 22.7027 3.5690 2.9737 155.9236 102.5756 140.2852 44.1394 107.7750 13.6173 3.1666 2.0983 2.1516 9.3832 8.3650 10.8736 3.5175 76.8419 21.9529 14.0175 12.5034 1.1204 0.7429 3.6765 8.6959 55.1064 15.9870 18.7066 1.8336 7.4126 5.1836 11.9228 9.8702 15.3004 51.2719 45.3605 94.6630 0.4999 52.5122 41.4484 17.4505 53.4085 43.2738 9.8051 226.1490 16.8558 21.6421 35.3910 420.2024 28.1459 9.0279 464.7038 518.9193 13.5752 31.1940 4.7213 13.5095 9.5646 2.2842 6.4405 210.8820 13.4121 90.4976 88.1165 41.7181
temp: 298.150 k
press: 1.00000 atm
elementType: 8 7 7 7 7 7 7 6 6 6 6 6 6 6 6 6 1 1 1 1 1 1 1 1 1 1 1 1
symmnumber: 1
zpe: 571767.6 jmol-1
zpe.correction: 0.217775 hartree
zpe.thermalcorrener: 0.233089 hartree
zpe.thermalcorrenthalpy: 0.234033 hartree
zpe.thermalcorrgfe: 0.175264 hartree
zpe.sumelectzpe: -752.732488 hartree
zpe.sumelectthermal: -752.717173 hartree
zpe.sumelectthermalent: -752.716229 hartree
zpe.sumelectthermalfe: -752.774999 hartree
dipole: -4.2680 -9.2468 -0.0839
dipole: 10.1846
quadrupole: -88.8412 -90.0224 -95.7880
quadrupole: 16.3656 -17.0919 2.6277
quadrupole: 2.7093 1.5281 -4.2375 16.3656 -17.0919 2.6277
hfenergy: -752.9502623 hartree
pointgroup: C01 [X(C9H12N6O1)]
dipole: 2.6198676 2.8042695 1.1523946 debye
polarizability: 165.4788299|-17.3962016|145.4519295|9.2901906|14.2620064|107.1816784 unknown
InChI: InChI=1S/C9H12N6O/c1-5-12-2-3-15(5)4-6-7(10)13-9(11)14-8(6)16/h2-3,13H,4,10-11H2,1H3
charge 0 multiplicity 1
28 atoms
O  0.546153 -2.25504 -1.888472
N  -1.906375 0.661317 -0.722776
N  2.392357 0.551762 0.432148
N  -3.419058 0.611124 0.963647
N  2.451682 -1.569734 -0.704111
N  0.604683 2.092623 0.283987
N  4.273226 -0.875148 0.597905
C  -0.808924 0.256566 -1.638795
C  0.507827 -0.038491 -0.951691
C  -2.468855 -0.101163 0.305283
C  1.132545 0.873878 -0.108972
C  -2.534441 1.922211 -0.705927
C  1.134968 -1.352681 -1.211136
C  -2.05242 -1.504426 0.62329
C  -3.46255 1.865081 0.337793
C  3.011858 -0.659106 0.068717
H  -1.093536 -0.6636 -2.180726
H  -0.702331 1.070161 -2.381212
H  -2.325229 2.678289 -1.460297
H  2.744576 1.089232 1.226953
H  -1.885376 -2.107705 -0.286567
H  -1.109582 -1.532278 1.201959
H  -2.841486 -1.973663 1.230929
H  -4.159704 2.63346 0.665081
H  -0.39125 2.279741 0.149305
H  1.178697 2.811848 0.717132
H  4.849574 -0.12928 0.979578
H  4.702376 -1.768478 0.365676
