program: Gaussian 09
title: 000258533
version: EM64L-G09RevD.01
frameworkgroup: C1[X(C14H17NO6)]
method: RPBEPBE
basis: SDD
operation: Freq
keyword: #p
keyword: freq=noraman
keyword: PBEPBE/SDD
title: #p freq=noraman PBEPBE/SDD
converged: YES YES NO NO
title: Mulliken charges:
elementType: O O O O O O N C C C C C C C C C C C C C C H H H H H H H H H H H H H H H H H
charge: -0.295124 -0.258789 -0.422819 -0.415410 -0.454943 -0.443204 -0.425422 -0.075064 -0.135352 -0.204285 -0.085529 -0.012489 -0.364105 0.210958 0.117878 0.252547 -0.321497 -0.392633 -0.346818 -0.247228 -0.209806 0.196234 0.254652 0.250099 0.224206 0.218000 0.223295 0.219792 0.358892 0.341395 0.366320 0.282901 0.358869 0.310286 0.245307 0.231501 0.223595 0.223787
chargesum: 0.00000
title: Mulliken charges with hydrogens summed into heavy atoms:
elementType: O O O O O O N C C C C C C C C C C C C C C
charge: -0.295124 -0.258789 -0.063927 -0.074015 -0.088623 -0.084335 -0.115137 0.121170 0.119300 0.045814 0.138677 0.205511 0.078982 0.210958 0.117878 0.252547 -0.038596 -0.147326 -0.115317 -0.023632 0.013981
polarizability: 2.45888158e+02 -1.17498258e+01 1.76143827e+02 9.45224561e+00 -2.12055661e+01 1.13244503e+02
1716.lowfreq: -2.5921 -0.0004 0.0003 0.0006 7.0044 11.9813 27.8360 38.3700 44.5969
frequency: 26.9384 38.2776 44.5390 83.6610 94.3590 102.2274 125.5730 146.8504 168.1540 191.2213 215.2620 220.6044 228.0090 254.7280 279.2216 326.7069 337.6688 359.3480 382.2813 393.0301 414.7677 419.9480 429.2109 441.3570 451.7526 466.0778 483.9498 502.8500 525.6972 571.2486 572.9118 587.2573 607.5205 623.6960 664.6819 713.6392 741.4319 748.5576 757.2705 768.4664 773.4536 818.8600 850.9428 852.2755 864.1446 926.6745 935.9914 946.7549 964.8154 974.3670 985.8711 1009.0812 1011.0576 1015.4151 1040.3547 1046.8085 1064.1807 1086.6359 1096.9461 1109.5974 1122.8772 1132.1369 1167.5837 1172.4220 1195.3266 1207.8167 1226.2430 1233.5923 1246.0246 1247.4817 1262.3010 1287.1870 1293.6469 1311.4426 1323.8205 1330.2460 1341.1055 1348.0213 1367.3126 1373.4937 1379.5074 1383.8293 1390.4334 1395.9155 1427.9937 1462.0431 1466.7884 1489.3228 1552.5725 1591.9503 1633.5634 2915.4603 2930.0336 2966.0589 3000.3943 3002.0261 3066.5338 3090.1847 3128.0740 3138.5856 3152.6969 3167.7365 3238.3082 3508.4372 3536.0563 3536.5092 3575.6335 3617.6868
redmass: 5.4487 6.0791 5.7753 6.1042 4.5686 5.8088 5.9839 3.7811 5.8946 4.3631 4.9379 4.1361 5.3235 4.6408 3.8675 5.2071 6.3667 3.6658 2.0351 1.6367 1.7576 2.8332 1.9690 1.9230 1.2696 2.2203 1.1876 3.7237 5.7737 3.1757 5.1051 4.4386 4.1079 4.5300 4.4082 5.8978 4.4001 1.4781 3.1084 3.8510 1.5249 3.8995 1.4504 3.2806 4.9688 2.9480 1.3746 4.6922 3.6662 1.3011 3.8839 2.1730 4.7826 5.1661 2.6065 2.8456 2.8026 3.1375 1.6695 3.0365 2.2762 1.5818 1.0867 1.1521 1.3515 1.3248 1.4041 2.3919 1.3453 1.4787 1.2829 1.2415 2.1869 1.4429 1.2633 1.2877 1.3631 1.6003 1.5891 1.1936 1.3330 1.4553 1.5333 4.6007 2.1679 4.8036 1.0861 3.2218 6.0842 6.3391 7.3082 1.0819 1.0832 1.0839 1.0817 1.0663 1.0869 1.1007 1.0853 1.0892 1.0953 1.1002 1.0991 1.0652 1.0653 1.0653 1.0661 1.0811
irintensity: 0.5882 1.4916 0.3320 0.4844 9.7872 0.9121 1.8578 2.4108 1.5014 0.0042 9.0672 15.6508 4.7235 5.9536 9.8106 11.3498 4.7792 13.0086 51.3971 41.9577 44.2934 23.9165 85.7209 94.1279 196.8838 99.8297 104.8531 50.1168 1.1063 11.5813 3.3918 1.3529 0.5815 4.5947 64.0287 31.1077 7.9765 100.6111 22.2414 11.7755 11.6397 36.2749 0.8116 39.1898 0.2626 131.8970 2.3978 126.2079 76.9015 0.0148 37.7385 22.7791 82.9877 52.1243 68.0924 22.1826 139.6254 81.7313 31.4700 57.8429 37.7789 31.2549 4.9868 51.0190 17.2373 18.5106 74.8974 80.5475 16.9017 6.6951 16.6359 11.2028 18.5400 32.7723 6.6469 25.1425 16.7325 61.7301 7.9088 27.3120 17.4968 13.3754 13.5453 17.0406 10.2547 21.0022 4.8275 8.1362 58.7313 2.9985 11.0625 23.3214 37.4045 34.1331 16.0175 60.4585 15.6542 26.8521 0.2648 8.4047 28.5452 24.7725 0.9986 5.2133 17.4805 13.0826 14.6819 66.4768
temp: 298.150 k
press: 1.00000 atm
elementType: 8 8 8 8 8 8 7 6 6 6 6 6 6 6 6 6 6 6 6 6 6 1 1 1 1 1 1 1 1 1 1 1 1 1 1 1 1 1
symmnumber: 1
zpe: 782475.0 jmol-1
zpe.correction: 0.298029 hartree
zpe.thermalcorrener: 0.317456 hartree
zpe.thermalcorrenthalpy: 0.318400 hartree
zpe.thermalcorrgfe: 0.250065 hartree
zpe.sumelectzpe: -1048.156910 hartree
zpe.sumelectthermal: -1048.137483 hartree
zpe.sumelectthermalent: -1048.136539 hartree
zpe.sumelectthermalfe: -1048.204874 hartree
dipole: 3.5666 0.6104 -2.4464
dipole: 4.3679
quadrupole: -129.7820 -121.1574 -124.6704
quadrupole: 1.8255 5.5794 -6.0884
quadrupole: -4.5787 4.0459 0.5329 1.8255 5.5794 -6.0884
hfenergy: -1048.4549387 hartree
pointgroup: C01 [X(C14H17N1O6)]
dipole: -1.3918984 -0.0752964 1.0050054 debye
polarizability: 244.1501964|15.8528994|166.4819105|8.0820313|32.9475054|124.6443802 unknown
InChI: InChI=1S/C14H17NO6/c16-6-10-11(17)12(18)13(19)14(21-10)20-9-5-15-8-4-2-1-3-7(8)9/h1-5,10-19H,6H2
charge 0 multiplicity 1
38 atoms
O  1.48643 0.987574 -0.224912
O  -0.178178 -0.676896 -0.432253
O  4.522799 -1.918068 -0.287277
O  3.985268 0.664231 -1.60178
O  1.84303 -2.728925 0.25735
O  1.7547 3.605763 0.572939
N  -2.755458 1.342871 1.178162
C  3.510773 -1.01032 0.225411
C  3.871013 0.446303 -0.159413
C  2.10714 -1.393459 -0.288356
C  2.776658 1.367951 0.434823
C  1.071077 -0.36815 0.196959
C  2.945199 2.86404 0.145024
C  -1.319647 -0.026344 0.086109
C  -2.658525 -0.456563 -0.235489
C  -3.546004 0.431081 0.471701
C  -1.394649 1.074379 0.94006
C  -3.196844 -1.492542 -1.042207
C  -4.950998 0.302848 0.386494
C  -4.595343 -1.620958 -1.127127
C  -5.462106 -0.732836 -0.420305
H  3.473342 -1.066027 1.33969
H  4.869821 0.68941 0.241727
H  2.091925 -1.413168 -1.397692
H  2.67478 1.20893 1.530201
H  0.966859 -0.384896 1.307218
H  3.158653 3.017788 -0.930846
H  3.781186 3.271602 0.736843
H  4.194931 -2.841234 -0.123883
H  3.066321 0.651677 -1.981156
H  0.983568 -3.059392 -0.107503
H  -0.6070 1.688833 1.368991
H  0.985474 3.217731 0.079197
H  -3.102248 2.097525 1.765061
H  -2.534802 -2.169815 -1.591139
H  -5.622527 0.981299 0.924219
H  -5.032073 -2.411964 -1.746359
H  -6.546846 -0.858583 -0.509182
