program: Gaussian 09
title: 000258527
version: EM64L-G09RevD.01
frameworkgroup: C1[X(C10H20N2O4S2)]
method: RPBEPBE
basis: SDD
operation: Freq
keyword: #p
keyword: freq=noraman
keyword: PBEPBE/SDD
title: #p freq=noraman PBEPBE/SDD
converged: YES YES NO NO
title: Mulliken charges:
elementType: S S O O O O N N C C C C C C C C C C H H H H H H H H H H H H H H H H H H H H
charge: 0.024117 0.022953 -0.405342 -0.405169 -0.242765 -0.242778 -0.595004 -0.595028 -0.085810 -0.085424 -0.175034 -0.175631 -0.661633 -0.705976 -0.661398 -0.705468 0.175023 0.175042 0.284933 0.285146 0.231300 0.211914 0.252621 0.229482 0.232141 0.273924 0.230659 0.212112 0.252590 0.229505 0.232153 0.273963 0.294862 0.287445 0.294850 0.287379 0.374154 0.374192
chargesum: 0.00000
title: Mulliken charges with hydrogens summed into heavy atoms:
elementType: S S O O O O N N C C C C C C C C C C
charge: 0.024117 0.022953 -0.031189 -0.030977 -0.242765 -0.242778 -0.012697 -0.012799 -0.085810 -0.085424 0.109899 0.109515 0.034201 0.029571 0.033964 0.030152 0.175023 0.175042
polarizability: 2.26673624e+02 -3.37567459e-02 1.63933260e+02 2.00736071e+01 6.89179534e-03 1.50423905e+02
1716.lowfreq: -14.6170 -0.0027 -0.0026 -0.0022 6.3048 9.0388 30.4999 37.4793 40.5166
frequency: 30.4814 37.1724 40.4848 57.0524 62.0420 67.7861 86.4293 99.5791 124.2192 141.9497 163.6129 209.0544 209.7874 228.2982 231.3268 234.5439 251.3099 256.6440 257.5579 259.1113 283.5987 286.6647 289.0519 301.4742 312.1506 328.5085 334.0639 352.4787 358.8861 377.8586 383.9315 447.5469 447.9309 454.9211 581.2308 584.9355 596.0106 605.9491 641.3293 641.8720 649.1869 650.0204 691.9631 694.6422 785.0662 785.2163 865.6409 867.0455 943.6241 943.8872 968.8392 970.2401 996.3330 996.6471 1046.4702 1047.0853 1078.0884 1079.4906 1103.7536 1108.1003 1144.8547 1152.9142 1193.4818 1194.4043 1221.7338 1223.5201 1250.7281 1252.0095 1332.1477 1332.9320 1365.3065 1367.6117 1374.6025 1374.9474 1385.0343 1386.2209 1447.4113 1455.9752 1465.1542 1466.5736 1472.2886 1479.5756 1483.2960 1493.0734 1636.3544 1636.4623 1646.7367 1646.8202 2980.0210 2982.0754 2986.1333 2986.5429 3056.8495 3057.3938 3077.2056 3078.1485 3079.8204 3081.5078 3091.7785 3093.7419 3101.6649 3101.8396 3464.2573 3464.5153 3495.9134 3496.0661 3594.3867 3594.6320
redmass: 4.7695 7.1226 7.6403 8.9030 7.3363 5.5486 4.7361 4.7987 3.8543 8.5484 6.8875 1.1067 1.1401 3.1098 2.8318 3.1331 3.3900 1.1687 3.4206 1.2055 1.9542 1.5165 1.2107 2.8358 2.7098 3.3724 2.6275 3.9729 3.4870 4.0963 4.1922 3.9171 4.5827 10.1077 2.5106 2.6140 1.3298 1.3278 3.3980 3.3972 1.6401 1.6352 3.5304 3.2865 3.3549 3.3480 3.4130 3.5130 1.3833 1.3845 2.7861 2.6680 1.3324 1.3030 2.1568 2.1699 2.3443 2.2481 1.6590 1.7877 2.4963 2.3060 1.8951 1.8773 2.4898 2.5716 1.8973 1.9294 1.5727 1.5761 1.2133 1.2152 1.3657 1.3629 1.1918 1.1933 1.0490 1.0497 1.0503 1.0532 1.0538 1.0489 1.0499 1.0496 1.5650 1.5161 2.4775 2.6321 1.0345 1.0344 1.0355 1.0354 1.0863 1.0863 1.0992 1.0982 1.0987 1.0986 1.1003 1.1003 1.1005 1.1005 1.0451 1.0450 1.0638 1.0638 1.0983 1.0983
irintensity: 0.2429 1.1045 0.1209 0.8107 0.5674 1.6328 0.0144 0.3673 2.3851 2.1854 0.0268 1.1459 6.6832 6.8236 5.3391 2.3072 4.2698 1.5806 0.0019 0.0269 36.8470 19.9895 6.1129 7.1134 10.5826 6.5228 16.7925 0.0128 5.9871 0.1805 1.1999 4.7746 15.1130 3.1865 3.3041 8.2329 247.7978 26.6844 28.4882 2.6658 31.5128 346.6520 133.3394 30.0445 3.1662 1.6747 15.6875 1.6698 1.8806 0.4419 72.7757 35.4230 3.4980 1.6306 172.6284 135.2629 121.1642 4.7204 112.6066 8.3710 46.6088 7.2877 4.1506 6.9088 3.9967 15.3812 8.9540 4.1607 7.5365 36.3462 31.8009 16.9707 1.5635 8.4853 39.7163 21.7842 13.6612 0.1597 4.9676 0.9243 18.4561 18.0857 34.1028 0.8440 26.7865 256.8257 19.5330 176.7364 2.8460 24.6811 27.6815 19.7221 3.4862 2.9155 7.5870 0.2229 42.7645 1.8271 1.5230 35.6619 9.5961 9.0128 3.7742 3.4981 4.6555 28.0940 8.7431 8.8424
temp: 298.150 k
press: 1.00000 atm
elementType: 16 16 8 8 8 8 7 7 6 6 6 6 6 6 6 6 6 6 1 1 1 1 1 1 1 1 1 1 1 1 1 1 1 1 1 1 1 1
symmnumber: 1
zpe: 793583.7 jmol-1
zpe.correction: 0.302260 hartree
zpe.thermalcorrener: 0.325574 hartree
zpe.thermalcorrenthalpy: 0.326518 hartree
zpe.thermalcorrgfe: 0.249827 hartree
zpe.sumelectzpe: -1598.142317 hartree
zpe.sumelectthermal: -1598.119004 hartree
zpe.sumelectthermalent: -1598.118060 hartree
zpe.sumelectthermalfe: -1598.194751 hartree
dipole: -0.0028 -1.1597 0.0011
dipole: 1.1597
quadrupole: -115.5352 -118.8983 -121.5689
quadrupole: -0.0179 -13.1585 0.0023
quadrupole: 3.1322 -0.2308 -2.9014 -0.0179 -13.1585 0.0023
hfenergy: -1598.4445775 hartree
pointgroup: C01 [X(C10H20N2O4S2)]
dipole: 0.0036573 -0.4561676 -0.0081388 debye
polarizability: 227.3777392|0.2732567|163.926752|18.6698662|0.4694549|149.7262979 unknown
InChI: InChI=1S/C10H20N2O4S2/c1-9(2,5(11)7(13)14)17-18-10(3,4)6(12)8(15)16/h5-6,13,15H,11-12H2,1-4H3
charge 0 multiplicity 1
38 atoms
S  -0.605385 0.125293 -0.906023
S  0.635277 0.095434 0.999446
O  -2.384697 2.010027 1.439236
O  2.359248 2.113419 -1.266872
O  -3.849325 1.78659 -0.348513
O  3.843201 1.854964 0.50005
N  -4.222048 -0.896629 0.9618
N  4.271725 -0.765148 -0.911796
C  -2.160903 -0.954092 -0.456399
C  2.215974 -0.927288 0.5070
C  -2.914614 -0.255927 0.728632
C  2.950002 -0.165505 -0.650919
C  -1.763086 -2.376646 -0.043712
C  -2.970183 -0.943988 -1.773498
C  1.85505 -2.343355 0.040978
C  3.025995 -0.946374 1.823581
C  -3.090476 1.25588 0.497365
C  3.090743 1.339932 -0.3611
H  -2.29177 -0.38243 1.630783
H  2.327544 -0.271716 -1.556003
H  -1.042908 -2.358144 0.793469
H  -1.307094 -2.918702 -0.890279
H  -2.671404 -2.914338 0.284714
H  -2.381893 -1.395529 -2.591568
H  -3.878631 -1.559104 -1.633782
H  -3.277276 0.073648 -2.067184
H  1.140626 -2.314268 -0.800803
H  1.407326 -2.926277 0.864497
H  2.778369 -2.846943 -0.299507
H  2.449171 -1.441212 2.624641
H  3.948576 -1.534319 1.661782
H  3.308828 0.066917 2.154246
H  -4.952803 -0.583441 0.314175
H  -4.530489 -0.887973 1.937449
H  4.996963 -0.459591 -0.254343
H  4.576512 -0.710733 -1.887125
H  -2.525584 2.980748 1.262596
H  2.478135 3.079522 -1.052711
