program: Gaussian 09
title: 000258528
version: EM64L-G09RevD.01
frameworkgroup: C1[X(C14H10Cl2N2O2)]
method: RPBEPBE
basis: SDD
operation: Freq
keyword: #p
keyword: freq=noraman
keyword: PBEPBE/SDD
title: #p freq=noraman PBEPBE/SDD
converged: YES YES NO NO
title: Mulliken charges:
elementType: Cl Cl O O N N C C C C C C C C C C C C C C H H H H H H H H H H
charge: 0.001032 -0.028604 -0.270335 -0.317676 -0.314705 -0.345575 0.432114 0.273995 0.159794 -0.308969 -0.356385 0.209184 -0.341033 -0.335111 -0.204035 -0.224291 -0.087340 -0.218257 -0.235540 -0.223769 0.267522 0.364245 0.277100 0.212795 0.354932 0.286066 0.266949 0.235355 0.234655 0.235886
chargesum: 0.00000
title: Mulliken charges with hydrogens summed into heavy atoms:
elementType: Cl Cl O O N N C C C C C C C C C C C C C C
charge: 0.001032 -0.028604 -0.270335 -0.317676 0.049540 0.009357 0.432114 0.273995 0.159794 -0.308969 -0.088863 0.209184 -0.063933 -0.122316 0.082031 0.042658 -0.087340 0.017098 -0.000886 0.012117
polarizability: 3.46266755e+02 9.85285624e+00 1.92112773e+02 2.95715252e+00 8.06259491e+00 9.12587870e+01
1716.lowfreq: -4.6085 0.0009 0.0010 0.0013 2.2394 6.0398 13.5785 23.5901 30.7300
frequency: 13.2340 23.4520 30.6958 37.0257 78.8490 97.8884 115.9538 139.6269 163.3701 168.0093 195.7034 230.3779 239.3173 293.8374 298.3383 343.8182 372.2495 384.9417 397.8272 430.0217 441.2042 458.7017 496.0877 524.5330 567.4221 580.1482 614.1035 617.2742 656.8482 663.9142 672.2516 695.8375 697.1786 742.4659 749.2455 790.5455 808.3181 830.9434 850.9302 873.1210 918.4672 935.9376 962.2818 986.8342 989.5644 1009.4198 1021.3066 1024.1388 1052.1200 1085.0732 1088.6236 1107.7640 1145.5902 1174.9573 1193.6394 1208.6616 1229.9425 1254.5919 1283.7671 1325.2929 1350.4601 1375.8259 1387.3668 1402.3168 1435.9015 1458.3949 1484.3024 1524.7313 1532.8242 1558.8728 1580.0992 1590.0774 1603.3254 1613.2741 3124.5608 3135.5352 3146.9079 3148.9558 3161.7855 3172.4930 3181.1259 3184.2262 3483.9700 3514.7495
redmass: 3.9822 8.5679 10.3657 8.4211 7.2128 9.0262 7.7943 7.9345 6.2524 7.5494 11.6219 6.9049 7.2251 9.8824 8.1857 8.3310 6.8149 10.0699 2.8025 4.1869 4.5896 4.3683 7.5233 6.4514 4.2924 1.2550 6.0602 1.2127 7.0409 6.3933 5.5150 2.8352 1.6777 4.4627 8.6933 2.2193 7.8041 1.4170 1.2585 1.4084 6.0615 1.4294 1.3564 1.3959 5.9084 1.3398 3.9074 2.8573 2.7223 2.0074 2.1942 2.6391 1.3797 1.0619 1.2287 3.2494 1.5905 1.3637 2.3485 1.3738 3.9785 5.5985 8.2656 2.9030 2.3076 2.7055 2.3154 2.7543 6.5246 7.4933 7.8346 7.1647 6.5369 5.8969 1.0872 1.0873 1.0899 1.0922 1.0958 1.1009 1.0955 1.0941 1.0798 1.0790
irintensity: 0.0224 0.1414 0.5302 1.6169 3.7802 7.0057 1.9182 0.6408 0.3059 0.8167 3.5746 16.5006 13.2262 0.3304 11.0952 1.8802 0.1679 12.7113 0.3232 3.3312 12.0433 3.9884 27.7252 2.1621 16.7207 50.8533 1.8008 118.5357 2.9444 7.2205 24.6975 33.2165 91.0561 2.4353 40.5833 26.9917 35.7889 35.7606 0.2534 18.3162 10.6242 4.0006 1.2007 0.6344 0.8030 0.8497 11.4004 40.0599 16.5034 61.9073 15.5205 4.5667 4.6688 1.5948 10.3174 2.5935 6.0722 1.5246 0.9569 4.9657 11.5696 14.2101 18.1177 993.5256 27.6965 71.7913 48.5410 91.3979 231.7825 41.6590 78.6880 109.7332 2.5791 8.3469 10.6804 1.7554 3.1906 20.3065 13.1641 22.5176 0.3410 1.0519 61.8539 111.0018
temp: 298.150 k
press: 1.00000 atm
elementType: 17 17 8 8 7 7 6 6 6 6 6 6 6 6 6 6 6 6 6 6 1 1 1 1 1 1 1 1 1 1
symmnumber: 1
zpe: 553486.2 jmol-1
zpe.correction: 0.210812 hartree
zpe.thermalcorrener: 0.228754 hartree
zpe.thermalcorrenthalpy: 0.229698 hartree
zpe.thermalcorrgfe: 0.160876 hartree
zpe.sumelectzpe: -1718.158875 hartree
zpe.sumelectthermal: -1718.140933 hartree
zpe.sumelectthermalent: -1718.139989 hartree
zpe.sumelectthermalfe: -1718.208811 hartree
dipole: 2.3359 -0.9797 0.5211
dipole: 2.5861
quadrupole: -106.0692 -130.9327 -134.4771
quadrupole: 7.5211 4.0749 -4.3899
quadrupole: 17.7571 -7.1064 -10.6508 7.5211 4.0749 -4.3899
hfenergy: -1718.3696868 hartree
pointgroup: C01 [X(C14H10Cl2N2O2)]
dipole: -0.9123178 -0.377114 -0.2462906 debye
polarizability: 345.9135027|-9.8258152|192.5900727|9.8615546|-4.3350507|91.1347399 unknown
InChI: InChI=1S/C14H10Cl2N2O2/c15-10-6-7-11(12(16)8-10)14(20)18-17-13(19)9-4-2-1-3-5-9/h1-8,17-18H
charge 0 multiplicity 1
30 atoms
Cl 3.201801 2.742572 0.922233
Cl 6.896282 -1.285676 0.162747
O  0.792632 1.842111 -0.956643
O  -1.788157 -1.8006 0.755255
N  0.150015 -0.156537 -0.011635
N  -1.187616 0.189431 -0.214072
C  2.531222 0.251404 -0.217808
C  -3.58572 -0.314034 0.00628
C  1.124884 0.734955 -0.422012
C  3.557414 1.071681 0.315473
C  2.883891 -1.062718 -0.630201
C  -2.156922 -0.70131 0.214404
C  -4.566851 -1.296814 0.29678
C  -3.996769 0.967398 -0.449753
C  4.884865 0.615517 0.438958
C  4.203009 -1.547557 -0.519979
C  5.186153 -0.692672 0.014073
C  -5.9361 -1.009208 0.125282
C  -5.367808 1.25284 -0.619646
C  -6.340779 0.265768 -0.335466
H  2.116044 -1.705352 -1.074252
H  0.268921 -1.038713 0.500375
H  -4.226953 -2.273269 0.656645
H  -3.269512 1.760595 -0.660411
H  -1.304301 1.096667 -0.675484
H  5.656833 1.262939 0.861662
H  4.459216 -2.557387 -0.850176
H  -6.686312 -1.774698 0.350414
H  -5.677331 2.243942 -0.96795
H  -7.404548 0.491326 -0.468094
