program: Gaussian 09
title: 000258534
version: EM64L-G09RevD.01
frameworkgroup: C1[X(C15H15NO7)]
method: RPBEPBE
basis: SDD
operation: Freq
keyword: #p
keyword: freq=noraman
keyword: PBEPBE/SDD
title: #p freq=noraman PBEPBE/SDD
converged: NO YES NO NO
title: Mulliken charges:
elementType: O O O O O O O N C C C C C C C C C C C C C C C H H H H H H H H H H H H H H H
charge: -0.219110 -0.386551 -0.444359 -0.448222 -0.461014 -0.417910 -0.214381 -0.017699 -0.156517 -0.084488 -0.232863 -0.094479 -0.152384 0.209125 0.372024 -0.184804 -0.371459 0.450675 -0.227167 -0.427779 -0.313841 -0.179436 -0.364467 0.256158 0.256019 0.285119 0.303103 0.267426 0.360857 0.356204 0.390223 0.309327 0.386249 0.233903 0.237472 0.247009 0.232813 0.245227
chargesum: 0.00000
title: Mulliken charges with hydrogens summed into heavy atoms:
elementType: O O O O O O O N C C C C C C C C C C C C C C C
charge: -0.219110 -0.386551 -0.083502 -0.092019 -0.070791 -0.031661 -0.214381 -0.017699 0.099641 0.171531 0.052256 0.208623 0.115042 0.209125 0.372024 -0.184804 -0.062133 0.450675 0.006735 -0.190307 -0.066832 0.053377 -0.119240
polarizability: 2.45323382e+02 -1.02283757e+01 2.25422741e+02 -3.35931748e+00 7.40760137e+00 1.06488109e+02
1716.lowfreq: -4.5941 -0.0007 -0.0006 -0.0001 4.0634 6.5005 18.6208 37.7088 47.1359
frequency: 18.3812 37.6961 47.1000 56.2387 73.8908 88.1658 114.4197 145.9606 156.7717 174.0421 178.6323 216.5105 226.7132 254.3618 264.0442 298.8356 304.6360 325.0929 363.9529 382.6235 399.0458 422.3724 428.6243 465.5440 471.0354 480.1368 500.9451 517.0262 540.6328 542.3548 580.9960 590.8105 596.6967 632.2670 642.1118 663.8598 698.1093 723.9956 742.1117 767.8979 771.6024 793.6549 800.8089 811.2913 829.8428 845.6139 855.1130 878.6755 905.5995 927.8647 928.3909 945.9364 984.6156 989.0184 993.0437 1009.6977 1023.0662 1030.5058 1035.8372 1047.8806 1058.1474 1074.4894 1092.4444 1127.4335 1140.3933 1177.8403 1192.6831 1216.1537 1223.7639 1228.4549 1242.0439 1243.3374 1249.3865 1258.4312 1271.8780 1288.2306 1294.9230 1323.3142 1336.0846 1341.3366 1346.1966 1375.0786 1376.4840 1395.6293 1399.3611 1424.1261 1439.6285 1454.7779 1493.6958 1560.7949 1588.3830 1619.0038 1684.1241 3028.6902 3038.2817 3048.0678 3077.7548 3127.2187 3128.4561 3128.7773 3133.8901 3155.7795 3168.9951 3179.8378 3250.3113 3480.2383 3524.4323 3569.7626
redmass: 5.9587 6.7327 6.6098 7.8167 7.0746 8.1701 5.9857 5.2458 7.4527 5.5988 4.6274 6.5236 6.5291 6.2650 5.7481 1.1892 6.9171 5.0820 5.5269 6.7798 5.9745 4.3390 4.6079 4.9644 3.6490 5.2469 1.1865 4.8547 7.0318 2.3233 4.6594 4.2828 4.8675 2.2228 3.6291 4.1836 4.4629 2.0578 1.9810 3.4989 1.3809 4.1517 2.3755 5.6857 5.2306 2.2611 3.5726 6.3787 3.4040 1.5500 3.4086 1.4406 1.3664 3.2576 1.3916 4.6475 3.1223 3.3737 3.5230 2.6075 3.1168 2.5748 4.1581 3.2827 1.3737 1.2616 1.1262 2.0276 1.2662 1.2976 1.7084 1.7345 2.0182 1.1971 1.2689 1.3425 1.3431 1.3284 1.6139 4.4399 1.5076 1.2349 1.8476 1.4582 2.5527 2.9871 1.1922 2.5947 3.9926 6.7787 5.7069 6.9561 9.4186 1.0851 1.0843 1.0855 1.0871 1.0883 1.0892 1.0884 1.0915 1.0948 1.0991 1.0960 1.0674 1.0649 1.0643 1.0662
irintensity: 0.2173 1.0029 2.0616 1.8470 1.7804 1.6304 0.3045 0.2726 0.9690 2.8197 3.8748 9.0934 5.0934 4.4280 2.8912 112.8447 5.0345 15.7537 21.6016 7.5256 19.1753 0.8414 7.1842 1.4640 1.4175 7.9997 91.5580 16.1987 1.7882 42.0123 12.3594 10.9468 30.8355 85.0653 11.2803 12.8628 18.1237 102.6881 38.7224 45.9898 10.8933 59.0606 37.2960 45.4485 144.5339 38.6319 88.8339 101.6347 9.7611 16.4086 25.6175 0.2265 1.3435 166.4870 4.5905 217.7537 6.8145 20.4255 142.4580 77.2960 105.3911 76.2130 14.3658 23.5727 6.6379 21.5720 69.2241 20.3743 53.8995 20.7270 1.6236 34.4543 30.0147 11.0766 2.5272 12.8134 2.9686 1.7648 28.3531 9.4786 14.7393 22.6753 65.2135 30.4144 5.2591 4.7543 71.1545 62.6289 43.6122 36.9496 6.2999 11.6624 246.6197 7.7073 7.1474 21.0569 40.9898 8.8519 3.8839 2.0784 14.7745 26.5648 29.1265 12.3652 438.2113 18.3292 41.0835 14.7290
temp: 298.150 k
press: 1.00000 atm
elementType: 8 8 8 8 8 8 8 7 6 6 6 6 6 6 6 6 6 6 6 6 6 6 6 1 1 1 1 1 1 1 1 1 1 1 1 1 1 1
symmnumber: 1
zpe: 748391.3 jmol-1
zpe.correction: 0.285047 hartree
zpe.thermalcorrener: 0.305150 hartree
zpe.thermalcorrenthalpy: 0.306094 hartree
zpe.thermalcorrgfe: 0.235496 hartree
zpe.sumelectzpe: -1160.193922 hartree
zpe.sumelectthermal: -1160.173820 hartree
zpe.sumelectthermalent: -1160.172875 hartree
zpe.sumelectthermalfe: -1160.243474 hartree
dipole: 2.8330 1.2458 0.0544
dipole: 3.0953
quadrupole: -105.4242 -120.9880 -142.7940
quadrupole: -8.1033 3.4259 1.6892
quadrupole: 17.6445 2.0807 -19.7252 -8.1033 3.4259 1.6892
hfenergy: -1160.4789694 hartree
pointgroup: C01 [X(C15H15N1O7)]
dipole: -1.178974 -0.2507455 -0.1736091 debye
polarizability: 238.4508991|10.012238|126.0015966|-18.7742365|43.3792068|212.7817368 unknown
InChI: InChI=1S/C15H15NO7/c17-10-11(18)13(14(20)21)23-15(12(10)19)22-8-5-1-3-7-4-2-6-16-9(7)8/h1-6,10-13,15,17-20H
charge 0 multiplicity 1
38 atoms
O  1.513218 1.542304 -1.224457
O  0.3217 -0.275635 -0.221562
O  3.804305 -0.068278 1.996738
O  1.626989 2.415703 1.827387
O  2.767253 -1.377579 -0.308317
O  3.813039 -0.187154 -3.447256
O  1.51935 -0.520177 -3.271932
N  -1.694908 0.426358 1.59849
C  3.205373 0.719009 0.919491
C  1.724046 1.075664 1.235485
C  3.350662 -0.035662 -0.421859
C  0.835261 1.113317 -0.024951
C  2.759747 0.832453 -1.569621
C  2.568119 -0.018486 -2.829954
C  -1.035695 -0.449343 -0.579245
C  -2.061317 -0.127395 0.379107
C  -1.348807 -1.006626 -1.819216
C  -3.439121 -0.403567 0.022684
C  -2.712635 -1.279324 -2.14881
C  -3.741035 -0.985199 -1.250523
C  -4.443043 -0.077813 0.992907
C  -4.067213 0.479368 2.216459
C  -2.677871 0.713369 2.473557
H  3.780681 1.661107 0.876344
H  1.29258 0.318364 1.916781
H  4.416874 -0.215733 -0.632369
H  -0.000663 1.81196 0.115585
H  3.49112 1.624929 -1.809116
H  3.547414 -1.015513 1.822894
H  2.087257 2.39794 2.704336
H  1.762888 -1.288358 -0.305769
H  -0.537708 -1.198127 -2.527202
H  3.722845 -0.798594 -4.227091
H  -2.943515 -1.715868 -3.126197
H  -4.785966 -1.192505 -1.509368
H  -5.496733 -0.271643 0.760789
H  -4.80917 0.738555 2.977729
H  -2.36172 1.151583 3.427554
