program: Gaussian 09
title: 000258481
version: EM64L-G09RevD.01
frameworkgroup: C1[X(C13H8BrNO3S)]
method: RPBEPBE
basis: SDD
operation: Freq
keyword: #p
keyword: freq=noraman
keyword: PBEPBE/SDD
title: #p freq=noraman PBEPBE/SDD
converged: YES YES NO NO
title: Mulliken charges:
elementType: Br S O O O N C C C C C C C C C C C C C H H H H H H H H
charge: 0.061790 0.956743 -0.398603 -0.483334 -0.485408 -0.011143 -0.040740 -0.226664 -0.226867 0.349765 -0.151387 -0.151308 -0.463377 -0.330499 -0.210340 0.425091 -0.168152 -0.373396 -0.241657 0.290129 0.290514 0.268336 0.268927 0.279873 0.264941 0.243522 0.263243
chargesum: 0.00000
title: Mulliken charges with hydrogens summed into heavy atoms:
elementType: Br S O O O N C C C C C C C C C C C C C
charge: 0.061790 0.956743 -0.398603 -0.483334 -0.485408 -0.011143 -0.040740 0.063465 0.063647 0.349765 0.116950 0.117619 -0.183505 -0.065558 -0.210340 0.425091 0.075370 -0.110153 -0.241657
polarizability: 3.87312006e+02 1.29761179e+01 1.92080480e+02 -6.49726705e+00 2.28858612e+01 1.18244093e+02
1716.lowfreq: -4.0875 -0.0011 0.0005 0.0014 2.8539 5.1482 10.4587 13.5003 24.4483
frequency: 9.3821 13.4171 24.4401 38.8598 67.7312 99.5362 110.2459 133.0099 139.9388 176.6065 185.2821 189.2261 233.6101 265.7594 324.5566 343.0575 355.2720 381.1757 398.3684 405.0404 407.2183 447.6932 459.1145 488.8431 508.5197 545.0688 562.7739 608.7760 646.2207 681.4180 686.3764 701.6202 710.1637 814.0145 826.0042 832.7273 836.5685 917.8237 920.4222 932.2461 951.4863 965.3805 975.8639 979.4858 984.2421 994.9670 1045.3843 1054.7064 1084.4738 1108.7860 1129.3655 1177.7674 1181.1216 1221.5357 1285.4498 1289.7042 1375.1801 1376.0852 1378.8736 1405.0985 1446.2601 1459.8949 1560.6658 1563.3170 1587.9003 1589.3705 2183.6702 3150.0108 3162.1838 3162.9336 3168.0995 3178.4037 3181.5591 3182.2374 3184.2191
redmass: 9.4527 6.5656 8.9531 5.3866 8.2486 8.6506 11.4117 10.5343 7.0159 7.0630 11.5996 9.6512 7.5900 7.8810 9.8063 8.5373 6.1310 5.2697 7.1463 7.8063 2.8880 8.4394 8.8259 4.7825 3.8756 8.4358 7.3632 7.1037 6.1586 1.9598 6.0307 4.3435 7.4376 1.6246 6.5679 1.2418 1.4726 1.8900 3.0388 1.4506 16.7310 1.3203 7.5596 1.3786 6.1604 1.3663 5.4390 1.9974 1.6330 1.3496 1.9415 1.1712 1.1271 4.3528 1.2303 1.3399 7.7299 3.6528 6.0064 3.0006 2.0624 2.4025 6.0802 5.8153 7.9922 6.1644 12.6325 1.0875 1.0900 1.0897 1.0934 1.0944 1.0965 1.0987 1.0977
irintensity: 0.8311 1.2073 0.4448 0.2380 4.0983 0.3108 3.3719 2.4854 4.2593 11.0813 0.1311 1.9409 0.8614 7.5441 7.3548 67.4816 1.0885 2.3909 4.1220 21.8442 0.0079 1.4194 60.4916 39.2509 68.4030 16.2227 1.3352 0.6107 1.5624 27.7409 36.9183 7.5026 5.9770 11.2528 134.5818 0.1354 30.9264 26.9025 27.0742 1.3644 55.8674 0.5823 67.9668 0.0663 0.5367 0.6004 95.4619 17.6201 9.1676 4.4875 2.4277 4.8138 17.4711 1.5521 1.1619 0.6665 0.2970 8.0319 16.5767 9.1483 60.3624 15.9786 55.7781 4.6876 0.9905 2.0338 26.5658 5.4914 2.9553 2.8060 3.2932 0.9171 0.0341 7.1624 4.1313
temp: 298.150 k
press: 1.00000 atm
elementType: 35 16 8 8 8 7 6 6 6 6 6 6 6 6 6 6 6 6 6 1 1 1 1 1 1 1 1
symmnumber: 1
zpe: 461482.3 jmol-1
zpe.correction: 0.175769 hartree
zpe.thermalcorrener: 0.193906 hartree
zpe.thermalcorrenthalpy: 0.194850 hartree
zpe.thermalcorrgfe: 0.124144 hartree
zpe.sumelectzpe: -1190.610644 hartree
zpe.sumelectthermal: -1190.592508 hartree
zpe.sumelectthermalent: -1190.591564 hartree
zpe.sumelectthermalfe: -1190.662270 hartree
dipole: -3.9284 -2.4510 -2.8856
dipole: 5.4558
quadrupole: -131.0588 -130.5087 -133.6770
quadrupole: -22.5347 -11.8300 7.6126
quadrupole: 0.6893 1.2395 -1.9288 -22.5347 -11.8300 7.6126
hfenergy: -1190.7864137 hartree
pointgroup: C01 [X(C13H8Br1N1O3S1)]
dipole: 1.4518625 0.1436052 -1.5744558 debye
polarizability: 384.3054293|-20.4489015|159.52238|-25.6767108|-41.2661313|153.8087693 unknown
InChI: InChI=1S/C13H8BrNO3S/c14-11-4-6-13(7-5-11)19(16,17)18-12-3-1-2-10(8-12)9-15/h1-8H
charge 0 multiplicity 1
27 atoms
Br 6.485423 -1.713246 -0.6196
S  0.722381 1.193111 0.653554
O  -0.380646 0.011811 -0.541258
O  0.284204 0.905818 2.189673
O  0.715698 2.69884 0.0483
N  -5.367397 -1.823106 2.184656
C  2.355093 0.362478 0.284144
C  3.121829 0.857185 -0.783252
C  2.743046 -0.715454 1.096264
C  -1.752563 0.216195 -0.452536
C  4.361236 0.234102 -1.049308
C  3.983535 -1.333311 0.824395
C  -2.511495 -0.545602 0.473168
C  -2.38742 1.149861 -1.318029
C  4.771836 -0.853275 -0.245761
C  -3.920392 -0.394645 0.505989
C  -3.789095 1.293948 -1.273972
C  -4.559585 0.528721 -0.370972
C  -4.709382 -1.174842 1.425465
H  2.77628 1.708413 -1.37754
H  2.111663 -1.053311 1.923623
H  4.990982 0.590956 -1.868344
H  4.324918 -2.1732 1.434942
H  -2.00161 -1.243593 1.143046
H  -1.771719 1.734864 -2.00801
H  -4.285675 2.005166 -1.941376
H  -5.647642 0.639814 -0.334862
