program: Gaussian 09
title: 000258562
version: EM64L-G09RevD.01
frameworkgroup: C1[X(C17H17Cl4O3P)]
method: RPBEPBE
basis: SDD
operation: Freq
keyword: #p
keyword: freq=noraman
keyword: PBEPBE/SDD
title: #p freq=noraman PBEPBE/SDD
converged: YES YES NO NO
title: Mulliken charges:
elementType: Cl Cl Cl Cl P O O O C C C C C C C C C C C C C C C C C H H H H H H H H H H H H H H H H H
charge: -0.016643 0.063102 -0.106619 -0.125581 0.882245 -0.477592 -0.154612 -0.494673 0.112948 0.534820 -0.743465 -0.692585 -0.696907 -0.512503 -0.410433 0.392771 0.269157 -0.357867 -0.548369 0.407495 -0.306122 -0.398587 -0.221702 -0.190521 -0.247842 0.225511 0.218891 0.216663 0.225562 0.214804 0.223764 0.216627 0.222224 0.224090 0.267611 0.263709 0.277261 0.274485 0.270187 0.229274 0.236231 0.233190
chargesum: 0.00000
title: Mulliken charges with hydrogens summed into heavy atoms:
elementType: Cl Cl Cl Cl P O O O C C C C C C C C C C C C C C C C C
charge: -0.016643 0.063102 -0.106619 -0.125581 0.882245 -0.477592 -0.154612 -0.494673 0.112948 0.534820 -0.082399 -0.028455 -0.033965 -0.244892 -0.146724 0.392771 0.269157 -0.080606 -0.548369 0.407495 -0.031637 -0.128400 0.007572 0.045711 -0.014652
polarizability: 3.61555653e+02 -2.80636983e+00 2.26517991e+02 4.66334652e+00 -3.32653380e+00 2.42975537e+02
1716.lowfreq: -3.9342 -0.0021 -0.0019 -0.0015 2.6922 5.6007 20.5594 30.2505 35.3255
frequency: 20.1513 30.0184 35.2603 43.8408 48.0896 54.8721 64.9844 81.9617 85.6429 104.9168 110.1985 117.3691 143.8340 158.5159 171.4882 190.0421 206.5097 212.2566 220.4077 224.7888 241.7948 252.2202 257.9954 268.6643 288.8112 306.1427 312.1106 321.4253 332.0664 342.1418 356.9479 375.0274 408.7355 422.1741 427.8191 454.6191 462.2457 470.5248 492.4517 520.8134 527.1834 553.4912 592.8446 610.8041 622.9578 645.6013 686.7102 704.6831 724.0883 743.2500 757.5822 771.4099 814.1655 826.1745 833.5305 840.9602 911.5531 912.5120 918.7145 932.6013 934.8029 949.7888 970.7018 972.5774 987.2329 992.8485 1020.3645 1023.0512 1026.8524 1048.0381 1049.3388 1083.9023 1098.3648 1131.4767 1158.4027 1171.9591 1187.3745 1188.7865 1203.5157 1208.8582 1218.0225 1267.1992 1296.5122 1315.8741 1361.7803 1377.1874 1381.6674 1389.2971 1400.0037 1408.9508 1445.0034 1462.6623 1465.2065 1466.5625 1471.0543 1472.2366 1484.9428 1489.4940 1499.0284 1571.9444 1595.0386 1598.1878 1608.9988 2974.6696 2977.4646 2981.6473 3070.2708 3073.6357 3073.9474 3080.2691 3081.8735 3084.2157 3136.5177 3140.9480 3147.8583 3165.2802 3165.5739 3174.7349 3181.4350 3189.2825
redmass: 6.8485 9.8513 4.0982 5.3077 9.0114 10.2066 4.8831 5.6274 6.7970 8.7246 8.4434 11.1219 6.4144 9.4516 5.2969 7.4479 4.1422 1.4661 4.5594 7.4820 4.4125 7.3176 1.2893 9.8863 3.7119 2.0094 3.3735 1.7503 5.5954 6.7013 2.7973 6.1196 2.9099 3.7583 6.9495 4.8649 5.3927 4.0356 3.2363 4.2343 7.4915 7.0036 7.2843 6.2276 5.2421 7.1550 2.4309 5.2467 5.1685 6.0151 1.4886 5.9580 7.0953 3.1334 1.2586 1.4262 2.0022 1.7406 1.9857 1.6730 1.6860 1.2381 1.3531 1.3730 6.0739 1.3115 2.3125 1.4588 1.3830 13.2349 5.7809 1.5278 3.6516 2.1465 2.6331 1.0876 1.4355 1.8186 2.9478 2.1940 2.8519 2.3062 1.5802 1.3044 7.0272 1.2949 1.2018 9.8497 3.0717 1.2077 2.2733 1.0499 1.1117 1.4009 1.7687 1.5586 1.1206 1.0521 1.0743 6.9493 6.2548 6.1266 6.7060 1.0354 1.0347 1.0358 1.1005 1.0998 1.1000 1.0998 1.0987 1.0994 1.0856 1.0908 1.0905 1.0897 1.0956 1.0942 1.0968 1.0961
irintensity: 0.5627 0.0121 0.3775 0.6883 0.0256 0.9491 0.0998 0.5424 0.2861 0.1608 0.3042 0.1969 0.4667 8.9044 1.4390 1.1688 7.5478 0.6200 0.9332 1.2045 5.0380 9.6026 0.6880 4.4115 8.4607 1.9693 0.5553 4.7510 10.0217 1.7106 1.4396 52.8434 0.2713 3.2303 48.3200 28.4231 56.1374 2.4874 8.1119 30.2327 25.3065 19.1427 41.2756 3.3783 31.3375 43.9961 14.6559 57.0595 17.0729 95.3533 88.6465 7.7343 70.3243 40.4964 1.1603 25.3945 47.5458 44.2658 29.0548 5.5141 7.5791 0.2675 0.3466 0.4189 7.0291 1.3492 0.0436 1.1436 0.2085 115.1979 133.6610 11.6961 38.0839 42.8326 195.9432 7.9538 7.1302 32.1715 4.0366 167.4238 13.8001 26.2087 3.9099 0.4384 2.6886 22.9537 17.4191 4.1103 18.1005 11.0365 5.3272 0.0496 3.1335 19.5184 63.9389 28.3339 16.6357 13.4463 35.3724 22.0559 19.1741 19.7808 13.0012 26.0150 26.9736 29.1330 13.0218 7.6751 5.9865 26.8408 113.2703 49.4488 0.2144 2.8129 12.7144 1.5721 25.5750 5.3828 4.5493 1.5901
temp: 298.150 k
press: 1.00000 atm
elementType: 17 17 17 17 15 8 8 8 6 6 6 6 6 6 6 6 6 6 6 6 6 6 6 6 6 1 1 1 1 1 1 1 1 1 1 1 1 1 1 1 1 1
symmnumber: 1
zpe: 787892.9 jmol-1
zpe.correction: 0.300093 hartree
zpe.thermalcorrener: 0.327082 hartree
zpe.thermalcorrenthalpy: 0.328026 hartree
zpe.thermalcorrgfe: 0.240991 hartree
zpe.sumelectzpe: -3063.288706 hartree
zpe.sumelectthermal: -3063.261716 hartree
zpe.sumelectthermalent: -3063.260772 hartree
zpe.sumelectthermalfe: -3063.347808 hartree
dipole: 3.6236 0.4627 3.8538
dipole: 5.3100
quadrupole: -161.8973 -195.8109 -182.6709
quadrupole: 12.7379 0.5198 -4.3693
quadrupole: 18.2290 -15.6845 -2.5445 12.7379 0.5198 -4.3693
hfenergy: -3063.5887984 hartree
pointgroup: C01 [X(C17H17Cl4O3P1)]
dipole: -1.1982033 -0.9440635 -1.4273977 debye
polarizability: 343.1339312|45.5767172|250.4518842|-2.0365983|8.1461034|237.4633662 unknown
InChI: InChI=1S/C17H17Cl3O3P.Cl/c1-16(2,3)12-9-10-15(23-24(20)21)14(11-12)17(18,19)22-13-7-5-4-6-8-13;/h4-11H,1-3H3;
charge 0 multiplicity 1
42 atoms
Cl -0.1583 -2.556814 2.337417
Cl -0.087034 0.245488 3.541267
Cl 3.374628 3.128293 0.858846
Cl 2.217334 1.612932 -2.18572
P  1.57952 2.890383 -0.431281
O  0.717852 1.806643 0.619795
O  1.611088 -0.558279 1.730871
O  0.866516 4.231011 -0.865525
C  -4.156915 -1.071026 -0.667206
C  -2.858345 -0.284964 -0.380307
C  -5.06543 -0.345793 -1.692776
C  -4.956388 -1.246309 0.660319
C  -3.792337 -2.475574 -1.237499
C  -1.921263 -0.799146 0.55272
C  -2.551377 0.949271 -1.003552
C  -0.704602 -0.15309 0.861324
C  -0.447354 1.095411 0.219703
C  -1.363236 1.641999 -0.699291
C  0.239112 -0.682103 1.932963
C  2.286258 -1.057613 0.569356
C  1.691766 -1.848283 -0.436307
C  3.651533 -0.705428 0.531984
C  2.500879 -2.276385 -1.514438
C  4.441408 -1.145318 -0.549119
C  3.868958 -1.930051 -1.578473
H  -5.980105 -0.942688 -1.858707
H  -5.380633 0.650667 -1.331469
H  -4.566939 -0.223185 -2.67233
H  -5.236591 -0.266201 1.087202
H  -5.883009 -1.81804 0.468038
H  -4.374932 -1.794418 1.422783
H  -4.71412 -3.056151 -1.426971
H  -3.23898 -2.384632 -2.190114
H  -3.168228 -3.055162 -0.533955
H  -2.13011 -1.740165 1.067999
H  -3.24181 1.391709 -1.725938
H  -1.158989 2.612169 -1.165974
H  0.640697 -2.139909 -0.391017
H  4.064946 -0.095052 1.339333
H  2.052954 -2.89025 -2.303353
H  5.500717 -0.871013 -0.588086
H  4.483265 -2.26923 -2.418912
