program: Gaussian 09
title: 000258507
version: EM64L-G09RevD.01
frameworkgroup: C1[X(C12H10O6S4)]
method: RPBEPBE
basis: SDD
operation: Freq
keyword: #p
keyword: freq=noraman
keyword: PBEPBE/SDD
title: #p freq=noraman PBEPBE/SDD
converged: YES YES NO NO
title: Mulliken charges:
elementType: S S S S O O O O O O C C C C C C C C C C C C H H H H H H H H H H
charge: 1.027606 1.027466 0.407111 0.407086 -0.363763 -0.363860 -0.485387 -0.518750 -0.485363 -0.518730 -0.442583 -0.442516 -0.074409 -0.074358 -0.109253 -0.109222 -0.396001 -0.395995 -0.489306 -0.489297 0.060363 0.060501 0.299864 0.299879 0.262141 0.262145 0.274608 0.263539 0.274623 0.263527 0.284180 0.284153
chargesum: 0.00000
title: Mulliken charges with hydrogens summed into heavy atoms:
elementType: S S S S O O O O O O C C C C C C C C C C C C
charge: 1.027606 1.027466 0.407111 0.407086 -0.363763 -0.363860 -0.485387 -0.518750 -0.485363 -0.518730 -0.442583 -0.442516 0.225456 0.225520 0.152888 0.152923 0.142146 0.142155 -0.205126 -0.205144 0.060363 0.060501
polarizability: 2.87249963e+02 -5.75716628e+00 2.33374924e+02 3.31341139e-02 -3.10993081e-03 1.77645482e+02
1716.lowfreq: -8.2042 0.0011 0.0013 0.0019 1.4864 2.8339 14.3950 19.6030 30.4828
frequency: 14.3940 19.4361 30.4803 32.2637 36.5761 36.6279 48.6434 81.1776 81.4451 117.1622 121.0123 131.1854 139.8954 186.1819 193.6808 202.4150 210.4044 219.7910 244.9737 248.6168 260.0562 288.1085 310.4689 315.9929 325.0041 370.4851 376.9876 432.0819 435.6223 447.3948 455.7399 489.0277 492.4152 528.1563 547.7286 554.1163 554.3666 609.9909 611.0513 682.1883 682.5544 718.0582 719.5050 757.9786 809.1312 809.7062 819.9016 820.0697 849.8880 849.9659 863.2665 883.4673 924.0635 924.5436 925.4534 925.4950 944.8466 950.9787 964.5796 965.1963 1055.6103 1055.7919 1095.3964 1095.7198 1164.3346 1212.9577 1213.2906 1217.3429 1226.7694 1319.8525 1325.9872 1331.9698 1332.6261 1412.7526 1415.7090 1433.1042 1433.2585 1513.0777 1513.1651 2273.8694 2974.2779 2975.0475 3043.8821 3043.9098 3186.0244 3186.0550 3202.2251 3202.2474 3237.8545 3237.9078
redmass: 5.5970 7.9034 8.9850 9.0198 8.5615 9.6664 10.4912 6.6321 7.4046 6.4318 9.8934 10.4043 8.0956 10.6644 5.7540 4.3474 6.4184 7.2028 8.8741 11.4088 5.1566 3.8967 10.4847 9.0820 3.8605 7.7809 12.8736 6.9964 7.0695 10.3974 10.7034 8.9340 7.5567 8.9829 8.5667 3.2134 3.1927 11.5483 11.5720 7.1973 7.1651 1.1684 1.1699 5.2996 8.6520 9.5400 6.0840 6.5250 1.2696 1.2650 9.9189 8.6739 5.2848 5.2431 1.3749 1.3748 2.1605 2.2803 10.5886 7.9056 1.7448 1.7479 1.1018 1.1014 5.0648 1.4055 1.3973 1.0772 1.0581 1.2249 1.1823 2.2726 2.2508 1.0910 1.0903 7.9083 8.0737 5.1649 5.1660 11.7487 1.0599 1.0603 1.0991 1.0990 1.0903 1.0903 1.0985 1.0985 1.1009 1.1009
irintensity: 1.6385 4.1879 0.2198 0.2046 2.0125 1.4755 0.9629 2.6242 1.5144 4.1442 0.1816 11.5514 3.2628 1.0906 0.4636 12.2792 3.2130 1.8246 2.8392 3.0578 6.6271 14.1906 0.1723 12.6289 0.4797 0.1137 22.7033 7.0493 12.1090 17.6635 115.4703 15.5695 125.2192 106.4998 14.1788 2.7006 13.7762 2.8095 9.2216 1.8915 7.1903 27.6627 190.8410 2.3195 88.6064 34.6554 6.6055 66.1700 5.9405 13.2412 113.3449 43.0792 101.8502 11.4643 0.7606 1.6230 11.1085 3.0518 187.6903 0.8450 2.2081 0.5952 0.5238 8.7837 65.4525 10.4799 40.1439 9.6411 2.5927 37.3125 9.3029 3.5493 0.1883 50.5210 21.7200 37.4168 14.7153 3.3961 4.8938 0.8092 7.2305 7.3247 1.5501 3.9686 3.3595 1.8693 5.1922 3.9286 1.6519 0.5149
temp: 298.150 k
press: 1.00000 atm
elementType: 16 16 16 16 8 8 8 8 8 8 6 6 6 6 6 6 6 6 6 6 6 6 1 1 1 1 1 1 1 1 1 1
symmnumber: 1
zpe: 517528.5 jmol-1
zpe.correction: 0.197116 hartree
zpe.thermalcorrener: 0.221245 hartree
zpe.thermalcorrenthalpy: 0.222189 hartree
zpe.thermalcorrgfe: 0.138844 hartree
zpe.sumelectzpe: -2504.756508 hartree
zpe.sumelectthermal: -2504.732379 hartree
zpe.sumelectthermalent: -2504.731435 hartree
zpe.sumelectthermalfe: -2504.814779 hartree
dipole: -0.0032 0.0024 -1.2314
dipole: 1.2314
quadrupole: -170.5819 -145.7775 -148.3593
quadrupole: 31.3476 0.0457 -0.0068
quadrupole: -15.6757 9.1288 6.5469 31.3476 0.0457 -0.0068
hfenergy: -2504.9536238 hartree
pointgroup: C01 [X(C12H10O6S4)]
dipole: 0.0014422 0.4844838 -0.0008013 debye
polarizability: 284.7650852|-0.0341837|177.6455127|-12.6824118|-0.0367298|235.8597716 unknown
InChI: InChI=1S/C12H10O6S4/c13-21(14,11-5-3-9-19-11)17-7-1-2-8-18-22(15,16)12-6-4-10-20-12/h3-6,9-10H,7-8H2
charge 0 multiplicity 1
32 atoms
S  -2.878665 0.194385 1.550075
S  2.878592 0.189856 -1.550152
S  -1.513359 1.106359 -1.154395
S  1.516426 1.103008 1.156005
O  -2.710704 -1.661145 1.164649
O  2.70423 -1.664588 -1.162371
O  -4.320481 0.379394 2.251733
O  -1.502116 0.64268 2.29459
O  4.321025 0.370322 -2.251659
O  1.503859 0.642045 -2.295854
C  -2.967002 0.922424 -0.123983
C  2.968941 0.917784 0.123799
C  -4.142666 1.348113 -0.718499
C  4.145628 1.341826 0.717399
C  -3.903597 1.860337 -2.042946
C  3.908648 1.853461 2.042434
C  -1.395208 -2.229982 1.551806
C  1.3880 -2.230449 -1.55164
C  -2.568892 1.803222 -2.42442
C  2.574391 1.797206 2.425509
C  -0.419307 -2.234752 0.456236
C  0.41214 -2.235332 -0.456094
H  -5.116354 1.299921 -0.226483
H  5.118787 1.292691 0.224421
H  -4.693038 2.256345 -2.685016
H  4.699322 2.248024 2.683865
H  -0.987746 -1.678444 2.423993
H  -1.650124 -3.256966 1.873443
H  0.981812 -1.675528 -2.422363
H  1.640898 -3.257085 -1.875906
H  -2.10574 2.12242 -3.35698
H  2.112803 2.116247 3.358903
