program: Gaussian 09
title: 000258454
version: EM64L-G09RevD.01
frameworkgroup: C1[X(C14H16O)]
method: RPBEPBE
basis: SDD
operation: Freq
keyword: #pfreq=noraman
keyword: PBEPBE/SDD
title: #p freq=noraman PBEPBE/SDD
converged: YES YES NO NO
title: Mulliken charges:
elementType: O C C C C C C C C C C C C C C H H H H H H H H H H H H H H H H
charge: -0.219201 -0.281688 -0.196258 -0.489199 -0.486023 0.511543 -0.200571 -0.199921 0.206312 -0.449341 -0.413690 -0.792389 -0.222504 -0.249425 -0.244655 0.258515 0.236180 0.229660 0.220874 0.210896 0.257757 0.205452 0.205598 0.244569 0.230386 0.263831 0.229987 0.252767 0.226811 0.224846 0.228884
chargesum: 0.00000
title: Mulliken charges with hydrogens summed into heavy atoms:
elementType: O C C C C C C C C C C C C C C
charge: -0.219201 -0.023173 0.039921 -0.038665 -0.017370 0.511543 0.004881 0.005677 0.206312 -0.204773 -0.183304 -0.045805 0.004307 -0.024579 -0.015771
polarizability: 1.80019651e+02 -2.33345471e+00 1.25425828e+02 -2.32945831e+00 -8.77639835e+00 1.23255891e+02
1716.lowfreq: -6.3227 0.0003 0.0003 0.0007 4.4667 11.0851 36.3654 56.1913 69.2454
frequency: 35.7070 56.0148 69.2406 79.6575 111.2316 149.2378 165.6032 205.4951 247.4251 267.6493 294.7574 340.8952 385.8057 403.7632 451.0620 504.0575 523.8345 570.4961 581.7093 602.9670 616.7252 666.8619 706.5367 730.1153 760.1299 774.2856 852.8746 870.1203 891.1926 912.1858 930.0785 946.5608 951.9327 966.3553 974.5205 976.5088 990.3211 995.4621 1018.1336 1025.4336 1033.6092 1064.2221 1079.5034 1094.9049 1155.3605 1167.4639 1171.9803 1188.9230 1197.4787 1200.9003 1216.2494 1265.2493 1284.4577 1299.3883 1309.8273 1324.1191 1335.5328 1353.5532 1365.5200 1377.0976 1384.1129 1441.6372 1442.9582 1450.1824 1453.7545 1459.0074 1482.4135 1590.6896 1611.4143 1625.5384 1680.8250 2959.8814 2965.0953 2974.0110 2986.9791 2997.6995 3012.5329 3020.8071 3056.6660 3096.1583 3112.6314 3119.2991 3122.2582 3128.0393 3133.3201 3144.0905 3162.5648
redmass: 3.9384 4.6116 3.3789 4.0391 2.9373 1.0782 3.4648 2.6652 3.7700 4.9116 3.9980 4.1818 2.0115 2.8087 2.8144 3.9993 3.2684 3.9644 2.8399 4.6405 6.3137 1.2504 1.6876 3.7874 2.2141 2.0687 1.2502 3.8678 2.2012 1.6143 2.0354 2.7477 2.2128 1.5875 1.3968 1.4026 5.9829 1.3268 2.0432 2.2376 2.2763 2.7225 1.6586 2.0528 1.2188 1.7872 1.0574 1.1202 1.1528 1.3835 2.1060 1.6023 1.2486 1.5112 1.2676 1.4114 1.6001 1.4973 1.2693 1.6583 5.0007 1.8936 1.1162 1.0680 1.1004 1.0870 2.2608 5.9114 6.1223 7.3295 6.4651 1.0622 1.0594 1.0377 1.0826 1.0898 1.0975 1.0944 1.0958 1.0838 1.0863 1.1001 1.0864 1.0996 1.0913 1.0958 1.1014
irintensity: 0.2286 6.7359 0.8798 0.0922 2.7944 0.2563 0.4612 1.1296 1.3769 2.9036 0.6200 1.0494 0.3198 0.0072 0.3271 6.7945 11.0248 7.2460 0.3051 2.4892 0.0241 50.1308 53.1690 6.7918 16.6460 35.3816 0.1578 0.5094 4.2201 3.9889 2.3766 6.5492 2.5058 0.7459 1.5723 0.5422 0.1731 0.1231 4.6619 3.2751 8.6877 1.5965 6.7706 8.8880 6.2360 35.8476 0.1087 0.9528 1.1595 15.8671 15.1651 13.8100 2.5288 25.9774 2.4531 4.2567 16.2633 1.6734 62.3260 1.0556 0.1635 16.9313 9.0004 8.7987 7.8177 15.7013 19.6317 1.7014 9.4601 84.2616 6.8814 26.5387 26.1715 3.3649 1.6564 8.6222 2.0674 59.0648 6.6104 6.9132 10.7541 15.1237 1.5431 71.8718 13.7931 36.8740 23.3845
temp: 298.150 k
press: 1.00000 atm
elementType: 8 6 6 6 6 6 6 6 6 6 6 6 6 6 6 1 1 1 1 1 1 1 1 1 1 1 1 1 1 1 1
symmnumber: 1
zpe: 680094.1 jmol-1
zpe.correction: 0.259034 hartree
zpe.thermalcorrener: 0.272915 hartree
zpe.thermalcorrenthalpy: 0.273859 hartree
zpe.thermalcorrgfe: 0.217659 hartree
zpe.sumelectzpe: -617.200472 hartree
zpe.sumelectthermal: -617.186592 hartree
zpe.sumelectthermalent: -617.185647 hartree
zpe.sumelectthermalfe: -617.241847 hartree
dipole: -0.5499 -1.3624 2.3651
dipole: 2.7843
quadrupole: -82.6502 -94.3214 -87.3180
quadrupole: -2.7393 2.1575 4.6493
quadrupole: 5.4463 -6.2249 0.7786 -2.7393 2.1575 4.6493
hfenergy: -617.4595064 hartree
pointgroup: C01 [X(C14H16O1)]
dipole: -0.1956086 0.2089747 -1.0573815 debye
polarizability: 177.8758345|10.9296355|122.1012709|4.930129|-7.0896217|128.724264 unknown
InChI: InChI=1S/C14H16O/c1-11(15)13-9-5-6-10-14(13)12-7-3-2-4-8-12/h2-8,13-14H,9-10H2,1H3
charge 0 multiplicity 1
31 atoms
O  1.255321 -1.905815 1.762067
C  0.605744 0.724739 0.250229
C  1.54024 -0.468048 -0.179984
C  1.047026 2.033237 -0.461729
C  3.013987 -0.156036 0.2040
C  -0.874722 0.420922 0.016381
C  2.548132 2.240125 -0.457318
C  3.431309 1.255856 -0.148921
C  1.087846 -1.763223 0.519215
C  -1.744839 0.204684 1.115073
C  -1.412051 0.322765 -1.29572
C  0.434777 -2.837871 -0.331782
C  -3.112215 -0.093971 0.914684
C  -2.776996 0.023304 -1.501422
C  -3.634614 -0.184944 -0.395506
H  0.76688 0.853015 1.338881
H  1.456109 -0.594239 -1.277496
H  0.546478 2.888229 0.035699
H  0.675661 2.045835 -1.507679
H  3.687561 -0.880501 -0.297184
H  3.13305 -0.332926 1.292719
H  2.915874 3.242138 -0.717589
H  4.508702 1.471285 -0.14553
H  -1.343428 0.263007 2.133909
H  -0.762448 0.480346 -2.165982
H  -0.471428 -2.427043 -0.816866
H  1.118522 -3.152128 -1.14426
H  0.163798 -3.710044 0.283326
H  -3.766207 -0.256881 1.778786
H  -3.172602 -0.045819 -2.521386
H  -4.694165 -0.414896 -0.554016
