program: Gaussian 09
title: 000003958
version: EM64L-G09RevD.01
frameworkgroup: C1[X(C15H10Cl2N2O2)]
method: RPBEPBE
basis: SDD
operation: Freq
keyword: #p
keyword: freq=noraman
keyword: PBEPBE/SDD
title: #p freq=noraman PBEPBE/SDD
converged: YES YES NO NO
title: Mulliken charges:
elementType: Cl Cl O O N N C C C C C C C C C C C C C C C H H H H H H H H H H
charge: -0.039928 -0.050018 -0.404982 -0.227572 -0.417491 -0.003932 0.250684 -0.030374 0.320541 0.455995 -0.272595 -0.314322 0.056258 -0.397882 -0.131157 -0.211614 -0.327566 -0.359012 -0.223644 -0.235152 -0.222728 0.270209 0.334851 0.284471 0.249043 0.264335 0.273036 0.259669 0.239017 0.239378 0.372484
chargesum: 0.00000
title: Mulliken charges with hydrogens summed into heavy atoms:
elementType: Cl Cl O O N N C C C C C C C C C C C C C C C
charge: -0.039928 -0.050018 -0.032498 -0.227572 -0.082641 -0.003932 0.250684 -0.030374 0.320541 0.455995 -0.002385 -0.029852 0.056258 -0.148840 -0.131157 0.052721 -0.327566 -0.085976 0.036026 0.003865 0.016650
polarizability: 2.46075983e+02 -7.62688354e+00 2.25668817e+02 1.88372205e+01 2.38159750e+01 1.44467172e+02
1716.lowfreq: -11.0603 -3.7911 0.0015 0.0022 0.0023 6.6443 30.8852 44.5691 59.8867
frequency: 30.8489 44.5604 59.8479 63.1413 94.4039 126.7772 139.4252 178.8264 194.1122 200.4158 212.1838 253.3696 272.3485 303.6994 317.3406 360.5040 364.0441 371.9915 396.1978 404.9820 422.9037 447.3863 463.8434 487.9908 508.3914 526.9380 577.4644 607.3408 634.8024 645.8320 663.1783 677.5400 699.4139 714.7006 722.1348 750.6828 770.8683 788.6676 817.7221 827.0709 873.2558 887.2451 898.5663 921.1867 950.8203 951.7571 963.5931 992.5841 1018.9119 1040.9906 1065.3158 1089.2520 1124.2485 1126.2042 1170.4265 1174.1755 1192.8530 1227.5618 1252.9003 1260.4592 1281.2283 1298.4895 1309.4419 1359.7560 1366.6617 1383.6766 1391.5133 1420.2414 1437.1033 1459.3949 1471.2455 1543.9424 1566.3523 1578.9701 1601.5131 1601.9705 1641.6886 2977.5006 3140.3888 3141.1761 3154.9033 3167.5370 3167.7647 3177.8289 3177.9947 3484.0612 3506.4817
redmass: 10.1227 8.9761 7.3965 8.0983 7.3298 6.4898 6.1475 8.6932 6.1942 6.7348 6.4899 3.5174 3.9782 11.3276 4.9937 6.7286 5.8807 4.8834 6.7411 1.9591 4.9357 4.0886 4.1690 6.4736 4.2530 4.1867 3.8106 2.7870 4.9226 5.4130 4.9650 6.0655 4.8095 3.3909 4.3113 2.2466 1.9304 4.2463 2.5325 2.3479 1.4526 3.4775 1.7194 4.5143 2.3512 1.4797 2.0645 1.3481 7.1508 2.2679 3.4191 2.2081 1.6606 1.9713 2.0165 1.0623 1.5818 2.0450 1.5942 1.5533 1.5068 2.7445 2.2773 2.7555 6.1369 2.9025 1.9004 2.2698 2.1809 2.5623 2.8050 9.0441 6.2537 8.5877 7.0058 6.9255 6.1094 1.0831 1.0901 1.0861 1.0906 1.0925 1.0951 1.0962 1.1004 1.0646 1.0759
irintensity: 0.8939 1.6658 1.4943 0.6481 0.6084 0.5458 0.5064 0.5418 4.1659 10.5028 0.1023 35.6269 9.2262 6.3509 6.1063 2.5410 10.3179 18.9538 8.5577 76.1587 6.1809 4.1811 6.9996 5.0175 9.5972 20.0151 30.2009 41.6521 4.7044 8.2726 8.2323 15.0330 7.9226 46.2771 10.0880 33.6344 23.1992 41.6559 48.2822 14.7616 1.3412 16.1881 12.9298 4.9437 26.7849 9.3409 35.7646 1.4679 35.4998 9.4996 296.3959 11.5994 5.8634 9.5860 6.9465 0.3393 7.6470 21.1749 7.7789 3.4839 62.2659 48.1704 96.3640 28.6503 4.5166 38.1882 15.6885 35.9550 7.6692 29.1245 87.9854 55.0244 11.2340 36.8749 14.0020 1.0439 513.2050 11.3404 6.2655 1.8783 8.0348 0.5641 5.0278 3.0447 13.4675 32.9116 34.9921
temp: 298.150 k
press: 1.00000 atm
elementType: 17 17 8 8 7 7 6 6 6 6 6 6 6 6 6 6 6 6 6 6 6 1 1 1 1 1 1 1 1 1 1
symmnumber: 1
zpe: 569033.8 jmol-1
zpe.correction: 0.216734 hartree
zpe.thermalcorrener: 0.234486 hartree
zpe.thermalcorrenthalpy: 0.235430 hartree
zpe.thermalcorrgfe: 0.170151 hartree
zpe.sumelectzpe: -1756.205301 hartree
zpe.sumelectthermal: -1756.187549 hartree
zpe.sumelectthermalent: -1756.186605 hartree
zpe.sumelectthermalfe: -1756.251884 hartree
dipole: -2.6886 2.5790 0.8418
dipole: 3.8195
quadrupole: -135.5514 -130.7388 -136.4257
quadrupole: 24.6882 6.3555 6.4819
quadrupole: -1.3128 3.4998 -2.1871 24.6882 6.3555 6.4819
hfenergy: -1756.4220347 hartree
pointgroup: C01 [X(C15H10Cl2N2O2)]
dipole: -0.4819865 1.2521246 0.6767418 debye
polarizability: 238.7633182|-16.9796031|223.9683168|18.755662|33.9476315|153.4803367 unknown
InChI: InChI=1S/C15H10Cl2N2O2/c16-8-5-6-12-10(7-8)13(19-15(21)14(20)18-12)9-3-1-2-4-11(9)17/h1-7,15,18,21H
charge 0 multiplicity 1
31 atoms
Cl -0.014351 4.801706 0.039089
Cl -1.327414 0.278145 2.470017
O  2.079311 -2.588751 -2.340691
O  3.163954 -2.807798 0.168397
N  2.578874 -0.624981 0.744626
N  0.339476 -1.524627 -1.061496
C  0.632807 0.733724 -0.041924
C  -0.158167 -0.468355 -0.453986
C  1.939533 0.629498 0.53273
C  -1.644467 -0.46584 -0.246301
C  1.776167 -1.536537 -1.420374
C  0.053402 2.023881 -0.185677
C  2.576879 -1.726178 -0.106621
C  2.606731 1.797944 0.984531
C  0.745863 3.161751 0.246862
C  2.018072 3.067599 0.849799
C  -2.292337 -0.123046 0.967217
C  -2.471059 -0.868766 -1.332334
C  -3.693992 -0.142863 1.102493
C  -3.874914 -0.893406 -1.219646
C  -4.48974 -0.520336 -0.001998
H  2.078534 -0.589893 -1.913712
H  3.185463 -0.716965 1.566001
H  -0.94532 2.118293 -0.621066
H  3.602745 1.710314 1.432854
H  2.539004 3.964798 1.194965
H  -1.974652 -1.169928 -2.260073
H  -4.151719 0.118509 2.060788
H  -4.485681 -1.202748 -2.073725
H  -5.580065 -0.533064 0.098473
H  2.284963 -3.409382 -1.814119
