program: Gaussian 09
title: 000023500
version: EM64L-G09RevD.01
frameworkgroup: C1[X(C19H24N2O)]
method: RPBEPBE
basis: SDD
operation: Freq
keyword: #p
keyword: freq=noraman
keyword: PBEPBE/SDD
title: #p freq=noraman PBEPBE/SDD
converged: NO YES NO NO
title: Mulliken charges:
elementType: O N N C C C C C C C C C C C C C C C C C C C H H H H H H H H H H H H H H H H H H H H H H H H
charge: -0.254543 -0.024537 -0.119576 0.215015 -0.567452 -0.390812 -0.388546 -0.395845 -0.502564 -0.045543 0.148540 0.241423 -0.103181 0.034388 -0.359341 -0.330722 -0.338111 -0.350008 -0.266488 -0.235134 -0.666810 -0.664790 0.207784 0.243341 0.208254 0.196617 0.189911 0.204141 0.210663 0.207818 0.240079 0.200540 0.254387 0.258265 0.203081 0.242107 0.213843 0.263170 0.228300 0.230937 0.205681 0.248907 0.220415 0.210417 0.256196 0.219785
chargesum: 0.00000
title: Mulliken charges with hydrogens summed into heavy atoms:
elementType: O N N C C C C C C C C C C C C C C C C C C C
charge: -0.254543 -0.024537 -0.119576 0.215015 -0.116327 0.014059 0.005506 0.022636 -0.061945 -0.045543 0.148540 0.241423 -0.103181 0.034388 -0.104955 -0.067552 0.123234 0.105942 -0.038187 -0.004197 0.008193 0.021608
polarizability: 2.44159022e+02 1.39655070e+01 2.79224941e+02 -2.41006049e+00 8.61666307e+00 1.53346093e+02
1716.lowfreq: -5.6296 -0.0009 0.0000 0.0004 3.5858 8.1053 34.7255 39.2148 45.2049
frequency: 34.6402 39.1042 45.1590 62.6814 66.7523 68.2281 90.8118 126.9275 140.8390 157.2030 168.5300 187.5072 197.2718 217.3816 232.6206 261.9684 304.0672 316.4900 324.3448 333.4410 348.1862 363.8947 386.0271 422.0309 437.3152 461.9981 471.6524 490.4187 523.0897 527.7529 559.6706 607.2618 631.1143 640.8073 670.2826 689.9928 731.3493 749.9312 769.1688 775.2762 782.4825 792.2423 808.4974 829.1666 846.7594 856.1583 869.6032 881.5999 908.3225 939.0921 950.5096 957.8520 963.4578 969.1393 993.2315 1019.7700 1024.7686 1042.1757 1069.9769 1070.2795 1080.2262 1095.2534 1100.7957 1113.4645 1122.0119 1136.5754 1156.1236 1174.2995 1204.4453 1210.4427 1211.7930 1237.5661 1249.9313 1251.9965 1274.1306 1281.0150 1300.4430 1316.3013 1322.3706 1330.9160 1340.6190 1341.5451 1345.4883 1357.1642 1357.8885 1368.7469 1384.2169 1386.5658 1390.1296 1414.2142 1424.5102 1444.4745 1453.9053 1457.0243 1459.6884 1463.7098 1468.2205 1469.4880 1470.0510 1473.5501 1480.7259 1483.7269 1486.7669 1496.3593 1549.5744 1554.6855 1568.0962 1618.7156 2958.1391 2967.4094 2968.9490 2975.1376 2976.3002 2981.8872 2984.7566 2986.4416 3011.2313 3016.4517 3026.8524 3037.6533 3049.7469 3065.5603 3067.8005 3069.8263 3083.5999 3084.2282 3097.9272 3100.5668 3125.0383 3136.9402 3153.6864 3168.9229
redmass: 4.0179 3.4600 3.3243 2.8797 3.0208 3.6789 2.7690 4.0150 4.1692 2.6762 3.3904 2.3734 1.5493 1.6642 1.6254 2.3629 2.7673 3.2968 3.3654 2.8743 3.0151 3.0085 3.3011 3.1183 4.0741 3.4215 2.1345 3.4174 2.8854 3.2101 3.8269 4.2687 4.7075 4.6826 4.9604 6.2980 3.5066 2.9531 1.8773 1.3695 1.3288 1.7691 2.9578 1.5033 2.6140 2.8033 2.6158 1.8501 2.9349 2.1584 2.1653 2.3369 1.3884 2.4126 1.3220 2.3377 2.5600 2.1754 2.1458 1.8934 1.8660 2.2440 1.7570 1.9783 1.9163 1.3398 1.4781 1.4081 1.3926 1.9044 1.7123 2.3420 1.6900 1.3292 1.2434 1.6590 1.3444 2.2706 1.4427 1.4941 1.3773 1.5138 1.4707 1.3306 1.4737 3.2260 1.2437 2.4514 1.2201 3.9500 3.1987 2.0957 1.1457 1.3229 1.0892 1.0929 1.0720 1.0628 1.1007 1.0843 1.1085 1.0718 1.0800 3.0572 7.9774 6.4983 8.4643 6.3492 1.0611 1.0669 1.0630 1.0654 1.0618 1.0634 1.0374 1.0378 1.0613 1.0962 1.1021 1.1024 1.0949 1.0958 1.1005 1.0939 1.0983 1.0985 1.1015 1.1022 1.0857 1.0897 1.0951 1.0995
irintensity: 1.4632 0.1911 0.4145 0.9194 0.1656 1.2764 0.7759 0.4232 1.5663 1.8219 1.1720 1.5016 0.9305 1.6196 1.2978 0.1103 3.6876 1.0906 0.6337 0.9546 9.0672 1.1736 3.4458 4.7992 1.7311 3.9219 0.7744 3.8477 4.5009 4.5566 1.1118 8.2691 3.0062 3.1693 8.2828 0.4562 2.6576 7.3677 18.3631 40.8661 7.4269 33.4264 0.6874 9.9919 15.5812 2.0266 4.4232 2.2562 0.2062 5.4588 0.9581 26.2755 1.1445 1.4964 0.4662 7.5340 7.4650 0.9900 12.6791 1.6485 9.6549 7.1701 15.0357 12.6767 7.1801 2.2105 19.4121 9.5649 11.6573 20.3873 8.8234 6.5119 46.8865 20.9692 7.7208 12.2764 20.5219 7.1119 5.6116 1.6006 12.5893 4.8017 5.8269 4.7716 0.2689 15.7742 17.4635 4.6018 21.4457 78.7788 33.1184 14.1374 28.1450 6.3150 5.7042 5.5914 14.0505 2.6384 7.3711 10.8929 7.0570 8.7999 19.2425 19.8088 17.6090 218.7183 10.1178 2.1626 34.6287 26.3007 19.4830 21.0984 32.8055 21.6660 38.1940 25.2157 35.9016 78.0310 27.8600 96.3173 27.4844 1.3865 6.2307 16.2126 73.3842 3.4561 15.5520 47.2245 0.3061 11.3677 22.1641 27.0880
temp: 298.150 k
press: 1.00000 atm
elementType: 8 7 7 6 6 6 6 6 6 6 6 6 6 6 6 6 6 6 6 6 6 6 1 1 1 1 1 1 1 1 1 1 1 1 1 1 1 1 1 1 1 1 1 1 1 1
symmnumber: 1
zpe: 1022707.1 jmol-1
zpe.correction: 0.389529 hartree
zpe.thermalcorrener: 0.410436 hartree
zpe.thermalcorrenthalpy: 0.411380 hartree
zpe.thermalcorrgfe: 0.339507 hartree
zpe.sumelectzpe: -921.548639 hartree
zpe.sumelectthermal: -921.527732 hartree
zpe.sumelectthermalent: -921.526788 hartree
zpe.sumelectthermalfe: -921.598660 hartree
dipole: 1.5720 -2.1856 3.8376
dipole: 4.6878
quadrupole: -124.1031 -120.2387 -140.2827
quadrupole: 4.7781 7.7189 -0.1223
quadrupole: 4.1051 7.9695 -12.0746 4.7781 7.7189 -0.1223
hfenergy: -921.9381674 hartree
pointgroup: C01 [X(C19H24N2O1)]
dipole: 0.7089275 0.7593979 1.5238759 debye
polarizability: 283.446839|-5.1481762|240.043757|-8.1973189|-2.5053755|153.2394593 unknown
InChI: InChI=1S/C19H24N2O/c1-3-21(4-2)19(22)18-14-10-6-5-7-12-16(14)20-17-13-9-8-11-15(17)18/h8-9,11,13H,3-7,10,12H2,1-2H3
charge 0 multiplicity 1
46 atoms
O  0.151108 2.048701 -2.034856
N  -0.798086 -2.564791 -0.070502
N  0.415556 2.484585 0.238397
C  0.843544 -0.792239 -0.554478
C  2.294729 -0.425917 -0.821814
C  3.258669 -0.677007 0.376387
C  3.707271 -2.147542 0.54127
C  2.573505 -3.161332 0.819641
C  1.513776 -3.278787 -0.314147
C  0.470554 -2.173469 -0.316524
C  -0.166648 0.184467 -0.515307
C  -1.535182 -0.203198 -0.283782
C  -1.802451 -1.606174 -0.057783
C  0.146577 1.636886 -0.827485
C  -2.631215 0.720221 -0.28132
C  -3.145945 -2.037656 0.178449
C  0.748419 3.899118 -0.064533
C  0.460834 2.059468 1.657364
C  -3.935407 0.272313 -0.054655
C  -4.195284 -1.114944 0.182154
C  2.258228 4.108178 -0.310678
C  -0.762496 2.519868 2.480227
H  2.666147 -1.00108 -1.694742
H  2.350809 0.637038 -1.115208
H  4.163009 -0.054588 0.225754
H  2.783883 -0.3206 1.313227
H  4.240202 -2.4579 -0.382276
H  4.449158 -2.205436 1.363171
H  2.061878 -2.911108 1.770419
H  3.03066 -4.159956 0.964074
H  0.960474 -4.227234 -0.208426
H  2.041019 -3.308579 -1.290786
H  -2.440044 1.780296 -0.483576
H  0.184595 4.189501 -0.967291
H  0.40036 4.521429 0.779872
H  0.535558 0.959994 1.691484
H  1.389985 2.463719 2.1067
H  -3.311917 -3.106441 0.345105
H  -4.768064 0.98436 -0.065642
H  -5.223083 -1.451111 0.358181
H  2.860448 3.784413 0.558239
H  2.580732 3.536859 -1.197759
H  2.471332 5.177252 -0.493699
H  -0.874498 3.619218 2.4668
H  -1.689307 2.069567 2.08648
H  -0.646191 2.20594 3.533875
