program: Gaussian 09
title: 000258466
version: EM64L-G09RevD.01
frameworkgroup: C1[X(C17H14N2O6)]
method: RPBEPBE
basis: SDD
operation: Freq
keyword: #p
keyword: freq=noraman
keyword: PBEPBE/SDD
title: #p freq=noraman PBEPBE/SDD
converged: YES YES NO NO
title: Mulliken charges:
elementType: O O O O O O N N C C C C C C C C C C C C C C C C C H H H H H H H H H H H H H H
charge: -0.319803 -0.206225 -0.184219 -0.181755 -0.182451 -0.182481 0.020356 0.022376 0.394993 0.257107 -0.643345 -0.558098 0.465032 -0.360708 -0.420488 0.335486 -0.808491 0.160844 -0.493302 -0.474350 0.439137 0.432150 -0.020781 -0.496092 -0.594850 0.225766 0.266163 0.238306 0.253667 0.241046 0.232471 0.226712 0.236915 0.329696 0.332887 0.341263 0.233529 0.217695 0.223839
chargesum: 0.00000
title: Mulliken charges with hydrogens summed into heavy atoms:
elementType: O O O O O O N N C C C C C C C C C C C C C C C C C
charge: -0.319803 -0.206225 -0.184219 -0.181755 -0.182451 -0.182481 0.020356 0.022376 0.394993 0.257107 -0.151415 -0.319792 0.465032 -0.107041 -0.179442 0.335486 -0.112393 0.160844 -0.163606 -0.141462 0.439137 0.432150 0.212748 -0.154829 -0.153315
polarizability: 3.45155253e+02 -9.86195048e+00 2.15255939e+02 1.77551901e+01 -4.13059018e+00 1.40181254e+02
1716.lowfreq: -36.1577 -8.6068 -4.5430 -3.7787 -0.0008 -0.0006 0.0001 14.0510 24.6037
frequency: -36.0888 13.6513 24.5893 35.8413 46.2264 49.5926 52.8148 87.1796 90.9091 107.4896 113.4176 132.1820 147.2343 177.1936 190.6086 195.6449 201.1399 243.7335 274.0818 302.8791 312.1216 333.7888 355.1602 360.6400 363.9165 427.3075 454.6681 464.7774 465.8325 482.8613 503.2049 516.6445 543.8884 569.7275 585.4936 632.4091 649.3432 682.9186 685.3746 698.5584 714.2648 724.6952 731.5181 739.2279 752.1530 769.4034 830.3463 865.9947 877.2911 883.9658 906.7134 919.1364 949.2500 954.1353 958.3540 974.2337 981.6920 987.4094 991.9997 1004.0530 1012.2197 1049.5958 1064.3713 1078.3392 1099.1725 1109.3605 1120.4642 1155.8541 1184.7202 1206.2551 1206.9425 1208.8145 1233.6815 1252.8061 1256.2399 1274.6802 1288.6142 1313.9768 1375.9600 1380.3666 1383.5642 1398.4594 1405.6663 1406.3851 1423.2557 1435.9336 1447.4312 1461.2212 1470.5712 1476.2154 1487.2982 1589.0818 1593.4420 1616.5075 1618.9167 1639.2073 1650.6979 2973.5501 2980.1571 3029.8754 3058.8669 3082.8062 3089.2692 3097.2635 3115.7243 3138.5896 3166.6207 3178.9373 3192.0936 3194.8537 3201.0442
redmass: 1.0258 6.1442 5.9594 6.0162 5.1744 10.8603 7.3737 6.3736 4.4560 3.2416 9.5133 9.2678 3.1131 5.8205 7.4054 4.9688 5.0885 3.0360 3.3272 9.4209 4.4837 11.5192 9.5799 4.7232 2.8689 4.7701 3.3860 4.8744 4.5006 4.1060 8.9347 6.6208 3.4295 1.8610 4.5229 6.5346 3.0677 10.0555 8.2663 2.8382 4.7167 9.1589 5.9567 6.2823 5.7108 4.1569 1.5184 10.4653 4.5127 1.6663 2.3796 1.5933 1.4114 1.9196 1.4241 1.4339 1.6190 6.1699 1.3932 1.2461 1.4398 1.5624 1.9729 1.8254 2.1621 3.4052 1.9531 1.5301 1.9011 2.0183 3.4388 5.1820 1.2314 2.8756 6.3805 1.4373 1.2302 1.4655 6.0397 10.5703 10.2843 1.3800 2.8130 4.6548 1.2123 5.6686 1.1589 3.9314 1.0476 1.1532 2.4677 8.0853 6.4395 7.7376 7.4293 11.0414 4.7709 1.0608 1.0376 1.0980 1.0975 1.0615 1.0988 1.0924 1.0912 1.0891 1.0965 1.0927 1.0928 1.1143 1.0929
irintensity: 0.4104 0.0288 0.0074 0.0495 0.1142 0.0426 0.1201 0.9909 0.2167 0.2790 9.5440 2.9191 0.6960 0.6660 1.9928 0.2348 0.7193 4.4923 0.8465 1.5092 3.3070 0.7089 1.4825 0.7783 2.2390 4.0583 5.3623 1.5205 3.2851 3.6517 5.3506 1.1521 3.1315 9.1658 0.4899 6.0121 6.7841 46.6754 24.1646 41.6211 1.2481 0.0028 9.3851 10.2029 14.2907 8.1665 35.5843 11.0712 13.4668 14.0808 2.0994 15.8539 73.4162 10.9657 5.0840 15.4220 22.8472 2.0839 2.5510 8.0030 11.6966 11.4734 104.8440 21.3424 22.9123 371.6727 28.5474 42.5146 158.9013 116.4224 221.5688 195.2569 1.1112 11.3290 44.4807 9.0435 0.3421 0.3890 6.8130 39.6394 147.5949 7.3783 8.9564 3.6783 4.7486 17.7426 39.8369 18.4759 13.7739 18.6120 75.2076 2.8295 3.8884 1.9165 16.6700 123.2202 18.6562 15.0299 35.8473 9.3431 17.8452 10.1200 18.0935 6.4546 15.1771 13.9884 6.0355 14.3815 28.7696 17.8662 9.0987
temp: 298.150 k
press: 1.00000 atm
elementType: 8 8 8 8 8 8 7 7 6 6 6 6 6 6 6 6 6 6 6 6 6 6 6 6 6 1 1 1 1 1 1 1 1 1 1 1 1 1 1
symmnumber: 1
zpe: 735504.9 jmol-1
zpe.correction: 0.280139 hartree
zpe.thermalcorrener: 0.302524 hartree
zpe.thermalcorrenthalpy: 0.303469 hartree
zpe.thermalcorrgfe: 0.225253 hartree
zpe.sumelectzpe: -1215.094332 hartree
zpe.sumelectthermal: -1215.071947 hartree
zpe.sumelectthermalent: -1215.071003 hartree
zpe.sumelectthermalfe: -1215.149219 hartree
dipole: -6.1647 0.3398 0.2612
dipole: 6.1796
quadrupole: -146.5490 -167.1066 -139.5829
quadrupole: -0.5513 1.5413 -9.9897
quadrupole: 4.5305 -16.0271 11.4966 -0.5513 1.5413 -9.9897
hfenergy: -1215.3744713 hartree
pointgroup: C01[X(C17H14N2O6)]
dipole: 2.4275685 0.1260231 0.0441435 debye
polarizability: 342.8344707|4.3373093|211.2570078|29.3406088|17.1797422|146.5009683 unknown
InChI: InChI=1S/C17H14N2O6/c1-3-4-12-7-11(2)5-6-16(12)25-17(20)13-8-14(18(21)22)10-15(9-13)19(23)24/h3,5-10H,1,4H2,2H3
charge 0 multiplicity 1
39 atoms
O  1.212261 0.376555 0.400673
O  0.73444 -1.920707 0.354865
O  -2.221667 3.729761 -0.002739
O  -4.081899 -3.18394 0.016755
O  -4.419974 3.13853 -0.165575
O  -5.688721 -1.569524 -0.131515
N  -3.167719 2.857099 -0.057487
N  -4.463397 -1.955012 -0.034571
C  3.414294 -0.415059 -0.498537
C  2.639891 0.206887 0.514051
C  2.821662 -1.044812 -1.755146
C  4.816188 -0.437234 -0.291908
C  5.441287 0.126277 0.848928
C  3.220586 0.794714 1.651197
C  4.620167 0.751895 1.819604
C  -1.063814 -0.287034 0.186159
C  6.948751 0.058164 1.01852
C  0.36353 -0.728592 0.312997
C  -2.06108 -1.288652 0.135001
C  -1.422138 1.07946 0.122536
C  -2.784921 1.416108 0.009946
C  -3.408746 -0.900224 0.02111
C  1.872605 -0.152242 -2.541591
C  -3.805536 0.448595 -0.043408
C  0.713682 -0.571435 -3.108891
H  3.665392 -1.324515 -2.417553
H  2.30134 -1.984964 -1.489471
H  5.441626 -0.912763 -1.058653
H  2.573758 1.274792 2.391854
H  5.072334 1.205051 2.708664
H  7.473522 0.474861 0.139058
H  7.280909 0.620244 1.907668
H  7.290703 -0.987468 1.135635
H  -1.785201 -2.346171 0.184149
H  -0.66039 1.861053 0.157197
H  -4.857568 0.731235 -0.131529
H  2.196878 0.890573 -2.677865
H  0.09502 0.102134 -3.712241
H  0.361745 -1.605541 -3.000088
