program: Gaussian 09
title: 000023388
version: EM64L-G09RevD.01
frameworkgroup: C1[X(C11H9N3O2)]
method: RPBEPBE
basis: SDD
operation: Freq
keyword: #p
keyword: freq=noraman
keyword: PBEPBE/SDD
title: #p freq=noraman PBEPBE/SDD
converged: YES YES NO NO
title: Mulliken charges:
elementType: O O N N N C C C C C C C C C C C H H H H H H H H H
charge: -0.244888 -0.214399 -0.401279 0.089457 -0.000871 0.277343 0.344456 0.186542 -0.282575 -0.311044 -0.343394 -0.362922 -0.246493 -0.157462 -0.321374 -0.326548 0.272666 0.224365 0.285671 0.225256 0.259045 0.291005 0.264010 0.248494 0.244938
chargesum: 0.00000
title: Mulliken charges with hydrogens summed into heavy atoms:
elementType: O O N N N C C C C C C C C C C C
charge: -0.244888 -0.214399 -0.110275 0.089457 -0.000871 0.277343 0.344456 0.186542 -0.009909 -0.086679 -0.057723 -0.137665 0.012552 0.106547 -0.072879 -0.081610
polarizability: 3.28552569e+02 -7.57016914e+00 1.40605535e+02 -4.18407137e+00 1.39943747e+00 6.34913187e+01
1716.lowfreq: -3.1759 -0.0002 0.0004 0.0006 3.2424 9.6238 34.9210 36.2393 47.3157
frequency: 34.9016 36.2301 47.3128 71.3943 118.9305 138.0282 185.2757 226.7513 238.2360 261.6969 353.4073 364.0386 372.9665 422.3208 472.4803 530.3289 584.6063 624.5477 649.9560 659.4726 667.4133 689.0209 732.7258 752.1050 759.7725 829.0935 836.7393 869.4630 875.9986 889.8323 893.0814 926.6401 931.3965 957.6871 965.7800 987.1566 1004.3172 1028.2302 1055.8674 1061.6241 1086.4419 1121.7918 1140.8849 1175.9928 1218.8246 1239.3876 1244.0760 1299.5599 1324.0706 1335.0755 1372.2906 1399.4145 1459.9157 1466.1120 1506.9167 1546.2796 1557.4409 1578.9193 1605.2069 1621.6472 2998.4150 3124.9330 3142.5673 3149.4624 3174.6819 3225.6698 3244.5709 3270.1389 3383.9546
redmass: 5.7053 4.1773 6.1141 5.7183 6.0235 5.8389 5.9896 4.3436 7.6266 4.5284 5.7353 2.6981 5.7287 5.9121 6.4109 5.6899 3.1123 1.2971 3.6999 6.1944 7.5474 4.5331 1.2726 3.0194 5.0728 1.3030 1.6478 6.4087 6.3043 1.2613 1.3700 3.5297 1.5001 3.4065 1.8138 1.4481 1.9066 3.2703 3.1456 2.1782 1.6382 2.5618 2.0009 2.4997 1.3354 1.7799 2.3501 6.5178 1.5732 1.8523 2.4412 1.8638 2.0704 3.5693 1.8573 7.3531 5.9331 5.6452 7.1194 7.9733 1.0872 1.0876 1.0896 1.0972 1.0966 1.0917 1.0998 1.1080 1.0752
irintensity: 0.2614 0.0027 0.6110 3.7267 7.7456 10.6268 9.6804 16.1210 1.9090 11.6679 1.2193 0.1655 2.1143 7.7921 3.8485 7.3074 8.4068 62.3856 13.8518 1.6861 43.9930 27.2763 88.2030 8.8953 16.4426 28.3095 32.9788 9.8243 8.1528 3.7241 0.0128 15.2598 33.9062 1.3540 0.6431 2.8049 43.6986 14.4037 29.0412 14.6119 22.0863 101.0599 35.7799 4.9792 26.2706 39.1149 205.9233 0.5118 6.8155 48.6959 7.0131 17.2443 4.3112 12.1330 270.0869 36.0528 1.1041 33.2804 103.0611 166.1429 35.0005 10.2094 30.0157 14.4284 6.0853 5.3334 0.8686 0.0198 8.7935
temp: 298.150 k
press: 1.00000 atm
elementType: 8 8 7 7 7 6 6 6 6 6 6 6 6 6 6 6 1 1 1 1 1 1 1 1 1
symmnumber: 1
zpe: 479232.8 jmol-1
zpe.correction: 0.182530 hartree
zpe.thermalcorrener: 0.195983 hartree
zpe.thermalcorrenthalpy: 0.196927 hartree
zpe.thermalcorrgfe: 0.140114 hartree
zpe.sumelectzpe: -738.085719 hartree
zpe.sumelectthermal: -738.072266 hartree
zpe.sumelectthermalent: -738.071322 hartree
zpe.sumelectthermalfe: -738.128135 hartree
dipole: 3.2968 -3.1219 0.5987
dipole: 4.5797
quadrupole: -85.5675 -91.0633 -95.0761
quadrupole: -1.9501 -1.5033 2.5460
quadrupole: 5.0015 -0.4943 -4.5071 -1.9501 -1.5033 2.5460
hfenergy: -738.268249 hartree
pointgroup: C01 [X(C11H9N3O2)]
dipole: -1.2950499 1.2370848 0.1973412 debye
dipolederiv: 0.0551001 -0.1901331 -0.0364473 -0.117812 -0.5857234 -0.0917665 -0.0178789 -0.0902911 -0.1499361 -0.6429721 -0.118477 0.0052597 0.7321466 -0.9241453 -0.08973 0.1076626 -0.0438905 -0.3303774 -1.8357314 0.474925 0.1075083 0.1754451 -0.2508397 0.0518239 0.071143 0.0568505 -0.2875093 0.5019734 -0.1635964 -0.0370478 0.7307201 -0.2640329 -0.038647 0.1185501 -0.0333047 -0.1003437 -0.441879 0.0048381 -0.0133939 -0.0724773 -0.306133 0.0213254 0.0029241 0.0181162 -0.2543116 0.0338418 -0.069048 0.0003861 -0.109315 0.0276974 -0.059615 -0.054781 -0.0468116 0.0309391 -0.3945662 -0.0014657 -0.0014947 -0.4772717 0.2537166 0.045977 -0.0933011 0.0476871 0.0129739 1.9747118 -0.1432427 -0.0639376 -1.2965871 1.2247516 0.1548258 -0.2072226 0.0812164 0.2202588 -0.3897551 0.1389695 -0.0680013 -0.112529 0.0100537 -0.0361179 -0.0329596 0.0124767 -0.0714504 -0.2757077 -0.1877481 0.0852749 -0.0423308 -0.1557899 0.0061434 0.1011169 -0.0095168 -0.0812641 0.3417411 -0.0913757 -0.0163704 0.0471329 -0.0766354 0.0174661 0.0091006 0.0143946 -0.1585955 0.740898 0.0620021 0.0172302 0.2732833 0.3126682 0.0824865 0.0346792 0.0762998 -0.0464446 -0.2210908 0.0886089 0.0169471 0.4225861 -0.1276246 0.0137886 0.0832355 0.013 -0.1920862 -0.408183 0.1804008 0.0344772 -0.1969134 0.3290084 0.0903546 -0.0406713 0.0915136 -0.1139957 0.4101487 -0.2227577 0.1341198 -0.0271905 0.1180435 -0.0644131 0.0881515 -0.0963408 -0.0266723 0.1421881 0.1711263 -0.0324131 0.0923261 0.3104093 -0.124232 -0.0094651 -0.0932656 -0.0298369 0.1602408 -0.0467931 0.007631 -0.0026479 0.0129837 0.051342 0.0295797 0.0322436 0.1428968 -0.0158938 0.1017699 -0.0662871 0.1149177 0.0424287 0.0492216 -0.0796633 0.0380946 0.1180339 0.1045136 0.0574846 0.0105154 0.0653089 0.0607803 -0.0261648 0.0120941 -0.0251722 0.1930477 0.0085219 -0.071436 -0.014781 -0.0810043 -0.1077809 -0.0645474 -0.0165913 -0.0579951 0.1834398 -0.005547 -0.0663648 -0.0141867 -0.0807431 0.0855715 -0.0223743 -0.0166744 -0.0220951 0.1950018 0.0677027 0.0014208 -0.0076538 -0.1142287 0.0099774 -0.0604633 -0.0391116 -0.0575336 0.3043151 0.060294 0.0305672 0.0053553 0.0417028 0.0679927 -0.0304619 0.0068583 -0.0303057 0.2189608 -0.0366631 0.0911072 -0.0534654 0.0800529 0.017921 0.0503567 -0.0567334 0.0542333 0.1114629 0.066113 -0.0307821 0.0007749 -0.0445715 -0.0852988 0.0734215 -0.000042 0.0703964 0.1114932 unknown
polarizability: 328.5290104|-7.7406693|140.4681367|4.382268|-3.8035863|63.6522756 unknown
InChI: InChI=1S/C11H9N3O2/c15-11(9-3-5-12-6-4-9)14-13-8-10-2-1-7-16-10/h1-8,14H
charge 0 multiplicity 1
25 atoms
O  -4.360386 1.292874 0.262493
O  1.087313 -2.074499 -0.178894
N  0.196921 0.091092 0.039386
N  -1.116096 -0.334009 -0.046168
N  5.292269 0.824513 0.069865
C  2.62637 -0.202555 -0.027142
C  -3.44416 0.228388 0.058247
C  1.253323 -0.831004 -0.073265
C  3.707963 -1.014902 0.395244
C  2.911559 1.13063 -0.421383
C  -4.153848 -0.950348 -0.175317
C  -2.048169 0.584116 0.135179
C  -5.554889 -0.620522 -0.116696
C  -5.644005 0.739872 0.14849
C  5.00617 -0.463729 0.433572
C  4.24647 1.59213 -0.356628
H  3.519855 -2.05547 0.675334
H  2.138197 1.799731 -0.816014
H  -3.704152 -1.922715 -0.362466
H  -1.833162 1.648994 0.351897
H  -6.391646 -1.302484 -0.253211
H  0.415814 1.0770 0.24861
H  -6.469109 1.433963 0.280834
H  5.860534 -1.064394 0.763801
H  4.499263 2.613329 -0.66327
