program: Gaussian 09
title: 000258475
version: EM64L-G09RevD.01
frameworkgroup: C1[X(C15H12N4O10)]
method: RPBEPBE
basis: SDD
operation: Freq
keyword: #p
keyword: freq=noraman
keyword: PBEPBE/SDD
title: #p freq=noraman PBEPBE/SDD
converged: YES YES NO NO
title: Mulliken charges:
elementType: O O O O O O O O O O N N N N C C C C C C C C C C C C C C C H H H H H H H H H H H H
charge: -0.255845 -0.255820 -0.184426 -0.184414 -0.184411 -0.184408 -0.178599 -0.178609 -0.178619 -0.178610 0.018850 0.018802 0.018806 0.018783 -0.742174 0.584867 0.584841 -0.535984 -0.535986 -0.535930 -0.535937 0.331740 0.331849 0.331840 0.331876 0.075749 0.075695 -0.504698 -0.504675 0.246584 0.246586 0.283792 0.283787 0.283805 0.283787 0.245326 0.254129 0.254107 0.254110 0.245330 0.254103
chargesum: 0.00000
title: Mulliken charges with hydrogens summed into heavy atoms:
elementType: O O O O O O O O O O N N N N C C C C C C C C C C C C C C C
charge: -0.255845 -0.255820 -0.184426 -0.184414 -0.184411 -0.184408 -0.178599 -0.178609 -0.178619 -0.178610 0.018850 0.018802 0.018806 0.018783 -0.249004 0.584867 0.584841 -0.252191 -0.252198 -0.252125 -0.252150 0.331740 0.331849 0.331840 0.331876 0.075749 0.075695 0.248864 0.248868
polarizability: 2.62070120e+02 3.77796892e-02 2.78901376e+02 8.90304176e-03 2.62846227e-03 1.97714024e+02
1716.lowfreq: -9.5261 -0.0009 -0.0006 -0.0004 3.6947 4.2034 4.8687 13.8478 23.2222
frequency: -9.4279 13.1746 23.2222 42.5475 43.5911 49.3719 54.1467 65.7375 66.6643 95.2209 96.3143 108.9816 114.4910 148.3850 158.2587 159.8529 171.6209 175.0689 208.8841 209.9563 217.9544 227.5313 229.9366 258.9459 298.6332 309.8973 310.1860 340.6456 341.5518 352.0773 353.3227 402.8209 404.7880 440.8047 445.1196 451.5715 475.1134 494.8634 508.8057 568.8528 627.1389 638.1057 640.8625 651.1325 661.0680 677.7229 678.7967 717.2721 718.5725 724.3608 733.9814 735.4310 749.0620 777.5098 778.9088 859.4119 864.2389 904.9154 909.3115 927.5146 936.5650 937.2787 942.6183 953.3002 953.8427 956.8404 1097.9472 1097.9816 1098.4436 1100.0860 1147.1898 1147.2935 1160.0446 1198.5885 1198.9708 1199.3234 1200.1306 1214.2310 1216.1687 1230.3057 1237.6110 1241.3054 1243.6301 1307.9481 1353.4906 1360.9421 1370.1072 1370.4428 1370.9102 1372.4224 1417.0751 1417.7414 1420.0321 1420.7029 1463.2363 1463.6770 1467.9724 1467.9792 1469.9558 1470.9311 1479.5846 1554.4601 1557.3708 1611.3568 1617.2404 3012.7886 3020.1331 3020.2688 3071.8706 3140.9248 3140.9333 3155.2810 3155.3160 3157.2306 3159.9161 3160.2010 3162.4993
redmass: 11.1446 10.0021 6.9055 15.0268 14.9916 7.2698 10.4932 7.5264 7.3214 1.1175 1.0818 9.1550 7.8379 10.1864 4.4812 4.4885 8.9605 13.1054 3.2085 3.0842 4.3797 4.7502 5.4601 10.4663 4.3059 10.9424 12.3180 8.6359 8.6745 6.0742 8.5533 6.8610 3.5780 6.4058 5.9137 6.7791 7.8154 7.9050 5.6724 3.6345 10.3844 5.5461 6.2799 6.6418 4.5844 11.3108 9.7876 8.4792 8.8171 6.1664 9.7874 12.8900 5.3735 5.5714 5.4662 8.0314 11.9884 4.4387 1.6548 8.1767 4.0709 1.4175 1.4982 3.0625 1.7640 5.8379 1.2038 1.2040 2.5998 2.5468 1.3218 1.3254 1.2483 2.2705 3.1216 3.2612 3.0717 3.8584 3.1226 7.5016 6.3046 3.5134 4.8802 1.4629 4.6571 5.7000 5.3232 9.1256 5.2025 5.1012 4.9107 4.1064 1.4949 1.4715 1.1902 1.1518 1.0569 1.0569 1.4938 2.3740 1.5912 8.3039 6.9894 7.1434 7.0835 1.0603 1.0270 1.0270 1.1034 1.1069 1.1069 1.1053 1.1053 1.0917 1.0931 1.0916 1.0930
irintensity: 0.0000 0.7845 0.5726 0.0000 0.3719 4.1885 1.3358 1.7229 1.6859 0.0001 1.6078 0.8265 0.0000 5.0314 0.0002 3.9783 0.0143 5.5688 17.0730 0.0140 14.1950 2.1897 0.0300 0.0000 1.0985 1.1297 1.1365 0.0003 9.7994 1.0998 0.9763 0.0000 0.5136 0.0000 0.3598 1.0600 8.5705 32.4074 4.4198 0.6984 21.6874 5.8861 0.0000 3.0631 16.0575 0.0001 75.3895 1.9310 0.0000 0.0000 6.3573 14.6363 13.8002 0.8468 54.0932 40.7109 0.0000 9.9322 37.6157 32.3050 103.9910 0.0187 7.0041 0.1254 1.8369 0.0041 0.0110 2.3169 43.1779 33.3022 11.9446 8.5767 0.0000 0.0004 1.9285 6.8436 126.8285 0.0099 599.8683 14.8789 223.4249 22.9813 24.1360 3.1880 0.1127 0.0000 2.6286 40.6659 304.5862 0.0005 0.0791 0.0001 47.9638 46.2815 5.3224 33.4863 5.6437 22.4040 148.0879 246.2614 55.4747 54.0099 0.0000 0.8731 14.8987 14.5117 17.7838 78.9265 2.0233 3.8728 6.8793 19.6797 1.8031 0.0000 3.9801 6.5679 0.0260
temp: 298.150 k
press: 1.00000 atm
elementType: 8 8 8 8 8 8 8 8 8 8 7 7 7 7 6 6 6 6 6 6 6 6 6 6 6 6 6 6 6 1 1 1 1 1 1 1 1 1 1 1 1
symmnumber: 1
zpe: 713493.9 jmol-1
zpe.correction: 0.271755 hartree
zpe.thermalcorrener: 0.298208 hartree
zpe.thermalcorrenthalpy: 0.299152 hartree
zpe.thermalcorrgfe: 0.212091 hartree
zpe.sumelectzpe: -1547.538493 hartree
zpe.sumelectthermal: -1547.512041 hartree
zpe.sumelectthermalent: -1547.511097 hartree
zpe.sumelectthermalfe: -1547.598157 hartree
dipole: -0.0021 -0.0006 -0.3181
dipole: 0.3181
quadrupole: -196.1053 -211.6278 -152.9517
quadrupole: -0.0091 -0.0030 -0.0015
quadrupole: -9.2104 -24.7329 33.9432 -0.0091 -0.0030 -0.0015
hfenergy: -1547.8102484 hartree
pointgroup: C01 [X(C15H12N4O10)]
dipole: -0.0008222 0.0002182 0.1251493 debye
polarizability: 262.0700921|-0.0309575|278.9014038|-0.008902|0.0026321|197.7140236 unknown
InChI: InChI=1S/C15H12N4O10/c1-28-14-10(16(20)21)4-8(5-11(14)17(22)23)3-9-6-12(18(24)25)15(29-2)13(7-9)19(26)27/h4-7H,3H2,1-2H3
charge 0 multiplicity 1
41 atoms
O  -4.904913 0.001438 -0.85661
O  4.904397 -0.001457 -0.858409
O  -3.444655 -3.476171 0.708116
O  3.445595 3.475948 0.707068
O  -3.444299 3.47777 0.709521
O  3.444734 -3.47764 0.708637
O  -4.184633 -2.681948 -1.29678
O  4.184853 2.681591 -1.298044
O  -4.184634 2.684292 -1.295548
O  4.184283 -2.684345 -1.296791
N  -3.601115 -2.533107 -0.159213
N  3.600827 2.533076 -0.160692
N  -3.60018 2.535236 -0.158488
N  3.599913 -2.535281 -0.159687
C  0.000311 0.000029 2.235968
C  -1.271716 0.000401 1.388592
C  1.27202 -0.000373 1.388115
C  -1.877773 1.210142 0.987512
C  1.87793 -1.210128 0.986857
C  -1.878218 -1.208991 0.987132
C  1.878363 1.209004 0.986372
C  -3.031037 -1.203905 0.177327
C  3.030877 1.203887 0.176135
C  -3.030598 1.205731 0.177707
C  3.030447 -1.205751 0.176612
C  -3.658734 0.0011 -0.268495
C  3.658416 -0.001132 -0.269871
C  -5.050911 0.001935 -2.344305
C  5.049918 -0.001797 -2.346152
H  0.000696 0.888185 2.892911
H  0.000169 -0.888103 2.892943
H  -1.481966 2.177669 1.312882
H  1.482254 -2.177642 1.312423
H  -1.482768 -2.176765 1.312203
H  1.483029 2.17679 1.311548
H  -6.138214 0.002196 -2.502343
H  -4.60008 0.919021 -2.752937
H  -4.600429 -0.915064 -2.753514
H  4.599354 0.915271 -2.755115
H  6.137171 -0.002094 -2.504538
H  4.598914 -0.918813 -2.754747
