program: Gaussian 09
title: 000258385
version: EM64L-G09RevD.01
frameworkgroup: C1[X(C8H12N2)]
method: RPBEPBE
basis: SDD
operation: Freq
keyword: #pfreq=noraman
keyword: PBEPBE/SDD
title: #p freq=noraman PBEPBE/SDD
converged: YES YES NO NO
title: Mulliken charges:
elementType: N N C C C C C C C C H H H H H H H H H H H H
charge: -0.271035 -0.408243 -0.267554 -0.450765 -0.429518 -0.461006 0.369998 -0.407906 -0.254435 -0.276907 0.229593 0.223403 0.212791 0.209451 0.215394 0.229047 0.228992 0.259343 0.300349 0.269668 0.242844 0.236495
chargesum: 0.00000
title: Mulliken charges with hydrogens summed into heavy atoms:
elementType: N N C C C C C C C C
charge: -0.011692 -0.107894 -0.037961 -0.014570 -0.004673 -0.002967 0.369998 -0.138238 -0.011591 -0.040413
polarizability: 1.16685210e+02 4.91345408e-01 9.42552297e+01 -7.33245204e+00 2.08444018e+00 6.70702621e+01
1716.lowfreq: -19.2563 -6.9131 -0.0006 -0.0006 0.0007 10.2995 37.5203 51.2037 149.3716
frequency: 37.4524 50.9335 149.3422 167.7734 249.2426 342.1419 435.3063 539.4440 560.0239 605.0333 614.0453 664.5540 691.6118 702.3801 728.1323 810.6876 852.0661 870.4540 875.1177 877.6188 901.5295 909.5719 927.6108 972.8461 1020.7313 1028.9607 1051.8303 1084.1626 1094.2810 1126.8719 1162.2189 1167.9335 1209.7953 1226.3451 1243.2873 1261.7548 1279.9049 1295.3834 1318.6213 1338.3797 1389.8002 1408.7449 1425.4880 1464.1608 1469.6755 1476.0373 1479.6449 1572.3181 2960.0531 2992.3648 2999.0840 3006.7275 3056.2631 3070.4525 3081.4717 3204.6625 3229.4174 3241.9487 3436.2233 3598.1139
redmass: 2.6360 3.4533 3.4276 2.7800 2.0666 3.9990 3.6798 1.5237 1.5895 2.7272 2.6043 2.6762 3.5320 1.3388 1.6290 1.2563 1.8829 4.5134 2.9723 1.4340 2.3585 2.2102 2.0963 2.0006 1.3512 2.1450 1.4948 2.0275 4.6236 1.3806 1.3188 1.3771 1.3511 1.8542 1.5130 1.5381 1.2499 1.3711 1.2211 1.5341 2.8111 3.0935 1.2741 1.1042 1.0913 3.7807 1.1276 4.2536 1.0847 1.0600 1.0630 1.0637 1.1011 1.1033 1.1060 1.0898 1.0984 1.1070 1.0755 1.0805
irintensity: 1.3650 0.3858 0.8105 1.3278 3.9316 5.3853 5.8723 68.3452 10.2208 15.2943 1.3917 48.7031 4.0015 143.4326 28.8885 46.9791 2.2854 10.5722 16.3924 2.2820 7.5560 1.2757 2.4246 7.6581 25.1788 0.5853 1.5940 16.8500 46.5821 3.4908 3.8970 2.7631 0.9932 5.0352 0.5664 17.3747 4.9684 4.5542 3.9390 31.3474 7.5323 6.8140 9.5695 4.4559 7.0137 3.4452 9.0569 6.3365 39.0216 37.7389 42.3266 34.3487 21.7990 24.6358 79.5460 5.3155 4.9171 3.3082 2.0861 33.1145
temp: 298.150 k
press: 1.00000 atm
elementType: 7 7 6 6 6 6 6 6 6 6 1 1 1 1 1 1 1 1 1 1 1 1
symmnumber: 1
zpe: 496498.3 jmol-1
zpe.correction: 0.189106 hartree
zpe.thermalcorrener: 0.198045 hartree
zpe.thermalcorrenthalpy: 0.198989 hartree
zpe.thermalcorrgfe: 0.154041 hartree
zpe.sumelectzpe: -420.769121 hartree
zpe.sumelectthermal: -420.760183 hartree
zpe.sumelectthermalent: -420.759239 hartree
zpe.sumelectthermalfe: -420.804187 hartree
dipole: -2.0710 2.6492 0.5464
dipole: 3.4068
quadrupole: -56.2602 -56.7292 -60.9615
quadrupole: 3.9232 -2.5492 1.4411
quadrupole: 1.7234 1.2544 -2.9778 3.9232 -2.5492 1.4411
hfenergy: -420.9582276 hartree
pointgroup: C01 [X(C8H12N2)]
dipole: -0.7267645 0.0868423 -1.1228332 debye
dipolederiv: -0.417483 -0.2184938 -0.1095057 -0.1752272 -0.3133677 -0.1131902 0.0738261 -0.2442564 -0.6048496 -0.1799499 -0.0342699 -0.1101071 -0.052834 -0.2046776 0.0428553 -0.1448193 0.0281808 -0.6011767 0.6020656 -0.0393864 0.0225514 -0.0538659 0.2740524 0.0046509 -0.0777434 0.0398882 0.3120237 -0.0966461 -0.0809736 -0.0291811 -0.0294605 0.0486495 -0.0720673 0.0433374 -0.0899895 -0.0269322 0.0658463 -0.0354307 0.0274078 -0.1220241 0.1102911 0.0120996 -0.0627527 -0.0368465 -0.1111068 0.2296215 0.0487194 0.0768978 0.1647484 0.3586516 -0.0055855 0.0305805 0.0568439 0.2811881 -0.0428147 0.013714 -0.1064163 -0.1220089 -0.1110869 -0.0156352 0.0399833 -0.0101341 0.2848186 -0.114991 -0.0610115 -0.0546507 -0.0189763 -0.2161811 0.0193199 -0.0482134 0.0120262 -0.114425 -0.1303641 -0.0612177 0.1893969 -0.0377999 -0.2299209 -0.0615212 0.1943112 -0.0499284 0.2164502 -0.0031552 -0.0987885 0.011199 -0.0798918 -0.2235408 -0.0028041 -0.035046 0.0059552 -0.0701977 -0.0941275 0.025637 -0.0156079 0.0531751 -0.1580479 0.0919739 -0.0107247 0.0888382 0.002076 -0.0096903 0.0937391 0.0585942 0.1131533 -0.0593076 -0.0563084 0.0521049 -0.0138656 0.0491748 0.0259945 0.0086785 -0.024015 0.0073264 0.0220114 0.1164562 -0.0455484 0.0782977 -0.1547692 -0.1125627 0.0856101 -0.0450394 0.1510979 -0.0170417 0.0618012 -0.0284031 0.0314743 0.0288161 0.0209338 -0.0628174 -0.0271387 -0.1302645 -0.1463357 -0.0847865 -0.0338799 -0.0741917 0.0563921 -0.1135891 -0.0170131 0.1327293 0.0166678 0.0728028 -0.033283 0.1232619 -0.004944 -0.0237267 0.0267343 0.0998489 -0.0738699 0.0420699 -0.1126256 0.0547891 -0.0591097 0.0325733 0.0125735 0.0051186 0.1292587 0.0689916 0.0495504 0.0504725 0.0497315 -0.0266989 0.1656936 0.2345636 0.2367836 0.0450765 -0.0436614 0.0549408 0.2913464 0.0025949 -0.0375582 0.0006965 0.1542191 0.1122033 0.0335419 0.0801985 0.0310141 0.1747428 -0.0210551 0.0718958 -0.017554 0.0161937 -0.0033054 0.0668269 0.0645769 0.0758962 0.2063845 -0.0204046 0.0835736 -0.0274086 0.0323844 -0.0066226 0.0587517 -0.09335 0.0627127 0.1827285 0.0303686 -0.102377 0.0286509 0.0263101 unknown
polarizability: 116.3389745|-7.8539912|67.1173058|2.2257589|0.806914|94.5544212 unknown
InChI: InChI=1S/C8H12N2/c1-3-7(9-5-1)8-4-2-6-10-8/h1,3,5,8-10H,2,4,6H2
charge 0 multiplicity 1
22 atoms
N  -1.634731 0.833654 0.881268
N  1.600586 0.039951 -0.93896
C  -0.754856 0.821094 -0.330752
C  -1.460847 -0.130422 -1.392076
C  -2.784891 -0.580179 -0.708138
C  -2.469386 -0.397652 0.803034
C  0.640176 0.353622 0.034644
C  1.24849 0.178217 1.284015
C  2.801708 -0.333417 -0.324474
C  2.604836 -0.256853 1.059467
H  -0.700959 1.854369 -0.732443
H  -0.823061 -1.009702 -1.594961
H  -1.647425 0.387257 -2.350173
H  -3.622539 0.082652 -0.998005
H  -3.062805 -1.616966 -0.969628
H  -3.366948 -0.296907 1.437176
H  -1.879212 -1.255872 1.175978
H  -2.224011 1.677882 0.89264
H  1.445665 0.076203 -1.944758
H  0.746584 0.352811 2.233053
H  3.677521 -0.61458 -0.90628
H  3.350306 -0.487662 1.819375
