program: Gaussian 09
title: 000258426
version: EM64L-G09RevD.01
frameworkgroup: C1[X(C18H19ClO2)]
method: RPBEPBE
basis: SDD
operation: Freq
keyword: #p
keyword: freq=noraman
keyword: PBEPBE/SDD
title: #p freq=noraman PBEPBE/SDD
converged: YES YES NO NO
title: Mulliken charges:
elementType: Cl O O C C C C C C C C C C C C C C C C C C H H H H H H H H H H H H H H H H H H H
charge: -0.069576 -0.239831 -0.313331 -0.431477 -0.410098 -0.062703 -0.386284 -0.309359 0.215796 0.332268 -0.706165 -0.349824 0.530545 -0.368716 -0.238466 -0.249841 -0.358561 -0.449923 -0.211113 -0.203719 -0.114058 0.222182 0.208675 0.225487 0.223788 0.246885 0.209434 0.206717 0.222909 0.203369 0.214967 0.245356 0.293916 0.233074 0.226454 0.225804 0.250452 0.232626 0.249912 0.252428
chargesum: 0.00000
title: Mulliken charges with hydrogens summed into heavy atoms:
elementType: Cl O O C C C C C C C C C C C C C C C C C C
charge: -0.069576 -0.239831 -0.313331 -0.000620 0.039177 0.184182 0.029868 0.116919 0.215796 0.332268 -0.245843 -0.055908 0.530545 -0.135642 -0.012012 -0.024037 -0.108109 -0.217297 0.038799 0.048709 -0.114058
polarizability: 2.42011419e+02 5.17276204e+00 2.14809121e+02 -9.39229561e+00 7.56551060e+00 1.56622042e+02
1716.lowfreq: -19.9929 -5.4412 0.0004 0.0015 0.0021 4.4733 12.6461 20.6150 23.7078
frequency: 10.9619 20.0011 21.4926 47.3598 53.5793 81.2672 110.1604 127.9268 155.2825 190.0096 206.6780 242.3476 277.8099 291.7959 294.9702 347.7609 354.9998 382.2680 390.5966 409.3410 434.4288 460.2670 470.2139 486.1063 526.2123 533.4137 578.6891 603.3577 626.5987 634.1696 659.1415 709.5922 726.2613 760.2170 765.8809 775.3412 789.1495 806.5319 827.3389 828.1984 840.5520 849.2729 867.2203 882.5651 887.6133 919.7594 933.2606 944.1575 954.2050 964.1471 978.2783 999.7530 1009.2424 1018.1305 1044.5364 1052.0014 1071.5804 1086.7697 1104.8374 1109.0088 1117.0626 1168.2186 1171.7302 1176.4697 1180.7713 1182.5135 1190.4220 1197.2882 1225.3798 1250.6675 1269.4254 1289.4915 1294.4139 1307.4701 1310.2503 1332.7412 1343.9627 1347.9179 1352.2731 1364.1171 1375.0600 1384.9904 1396.2396 1437.0981 1447.8426 1457.3461 1461.9486 1462.4533 1475.6954 1476.7277 1484.2093 1586.1827 1594.1713 1598.4810 1606.1960 2981.3330 2986.9212 2997.1400 3000.0550 3002.5346 3031.3489 3046.7886 3055.3334 3059.2493 3073.0328 3089.1688 3120.3788 3127.8215 3135.3350 3142.3659 3157.9718 3165.7925 3169.2780 3173.4184
redmass: 4.9366 4.3350 4.3720 4.4026 5.9295 4.2434 5.4896 4.2497 4.3947 4.0717 4.7414 3.4685 4.6945 6.0696 2.8805 2.2105 2.9346 4.4244 2.9557 2.8800 3.7736 3.8004 3.2079 3.2615 2.6850 3.4072 5.2904 6.3112 6.6903 4.5983 3.5910 3.5925 4.5280 1.3567 4.0154 3.2103 2.1166 2.9430 1.3679 1.7996 2.0416 2.6630 1.8271 2.2891 3.1736 1.7531 1.5639 1.3907 1.4834 1.3714 1.3153 4.4235 2.6214 2.5841 2.1110 1.9684 2.7115 2.0411 1.8807 1.5949 2.0290 1.4378 1.2762 1.1716 1.3505 1.1951 1.5196 2.8845 2.6238 1.2418 1.2043 1.3531 1.3576 1.4116 1.4624 1.1774 1.3845 1.5125 1.4290 1.2865 6.9696 6.5626 2.6066 2.2835 1.0898 1.0880 1.1655 1.1035 1.3467 1.6295 2.2503 7.5169 6.8289 6.2114 6.5218 1.0669 1.0595 1.0614 1.0592 1.0638 1.0868 1.0999 1.1018 1.1010 1.1024 1.0999 1.0875 1.0897 1.0893 1.0887 1.0959 1.0954 1.0964 1.0975
irintensity: 0.1231 0.1375 0.1663 0.7368 0.0182 1.1417 1.0126 0.9516 0.6593 6.5102 1.4473 0.6273 2.7443 0.3791 2.0713 4.1295 7.2829 4.3688 3.2186 0.0331 5.9775 13.1748 5.9441 13.3599 7.4901 1.5575 19.8073 3.5619 0.0557 11.1013 0.4878 1.1864 11.0840 92.8545 28.4144 7.7685 20.1406 28.4676 5.9811 12.1890 31.1325 12.7770 6.4765 36.5892 207.5947 16.2210 39.7735 2.5764 1.3282 0.0486 0.4278 34.6919 85.2518 39.3978 23.9285 9.0636 34.3505 17.0936 17.7831 68.3511 8.0227 38.5593 9.0777 2.2526 60.2788 3.5060 4.4991 23.1705 57.5353 1.9731 8.5570 0.4344 1.6753 10.2400 4.6856 11.0533 0.5380 7.4859 0.3399 1.6220 0.2496 4.0034 8.3841 25.9126 9.6799 13.3004 17.2307 20.0243 18.5823 92.7676 57.5630 2.8547 7.5140 7.6317 18.6553 42.7487 37.4311 25.2192 26.2629 14.4546 47.3179 23.5475 7.7570 54.8576 43.8259 44.9081 5.9449 12.0769 15.0455 3.1847 24.3823 9.5562 0.9614 9.3447
temp: 298.150 k
press: 1.00000 atm
elementType: 17 8 8 6 6 6 6 6 6 6 6 6 6 6 6 6 6 6 6 6 6 1 1 1 1 1 1 1 1 1 1 1 1 1 1 1 1 1 1 1
symmnumber: 1
zpe: 851544.4 jmol-1
zpe.correction: 0.324336 hartree
zpe.thermalcorrener: 0.343108 hartree
zpe.thermalcorrenthalpy: 0.344052 hartree
zpe.thermalcorrgfe: 0.273483 hartree
zpe.sumelectzpe: -1306.287284 hartree
zpe.sumelectthermal: -1306.268512 hartree
zpe.sumelectthermalent: -1306.267568 hartree
zpe.sumelectthermalfe: -1306.338137 hartree
dipole: 2.5768 -0.4366 1.4331
dipole: 2.9806
quadrupole: -139.1159 -120.3229 -127.8375
quadrupole: -11.3694 -3.5457 2.0180
quadrupole: -10.0238 8.7692 1.2546 -11.3694 -3.5457 2.0180
hfenergy: -1306.61162 hartree
pointgroup: C01 [X(C18H19Cl1O2)]
dipole: 0.9640515 -0.0788497 0.6629704 debye
polarizability: 240.8863525|8.7597155|214.8811236|-0.7142405|13.6255671|157.6751061 unknown
InChI: InChI=1S/C18H19ClO2/c19-16-10-8-14(9-11-16)13-15-5-1-2-6-17(15)21-18-7-3-4-12-20-18/h1-2,5-6,8-11,18H,3-4,7,12-13H2
charge 0 multiplicity 1
40 atoms
Cl -5.090715 -2.31821 -1.797573
O  3.53948 -0.58789 -0.647927
O  1.595034 0.007919 0.689284
C  3.114309 -1.642325 1.564182
C  2.453832 -2.854047 0.866117
C  3.023288 -0.380646 0.694575
C  3.051355 -3.038925 -0.549007
C  2.915064 -1.736447 -1.355592
C  1.249678 1.320888 0.27524
C  -0.03892 1.772511 0.676586
C  -0.965755 0.890124 1.509252
C  2.109818 2.137804 -0.497585
C  -1.986368 0.104315 0.682813
C  -0.436165 3.070653 0.277923
C  1.685705 3.431979 -0.871299
C  0.411123 3.903845 -0.486489
C  -1.565558 -0.778164 -0.347095
C  -3.37501 0.230543 0.934872
C  -2.500711 -1.516329 -1.104118
C  -4.329121 -0.499768 0.187609
C  -3.872681 -1.364643 -0.822634
H  2.64612 -1.436772 2.54302
H  4.188135 -1.848622 1.736128
H  1.362655 -2.684389 0.791467
H  2.603228 -3.765887 1.472364
H  3.623433 0.460592 1.088047
H  4.12212 -3.310935 -0.472107
H  2.537731 -3.857013 -1.089813
H  3.449683 -1.780948 -2.317852
H  1.847644 -1.502179 -1.544882
H  -1.507196 1.522186 2.237054
H  -0.347387 0.178357 2.086301
H  3.074585 1.749777 -0.835231
H  -1.427831 3.430774 0.578359
H  2.349963 4.062269 -1.47298
H  0.079329 4.905443 -0.779713
H  -0.495764 -0.885914 -0.556486
H  -3.724308 0.906186 1.724848
H  -2.171559 -2.193839 -1.89768
H  -5.399463 -0.395574 0.388124
