program: Gaussian 09
title: 000258377
version: EM64L-G09RevD.01
frameworkgroup: C1[X(C10H13NO3)]
method: RPBEPBE
basis: SDD
operation: Freq
keyword: #p
keyword: freq=noraman
keyword: PBEPBE/SDD
title: #p freq=noraman PBEPBE/SDD
converged: YES YES NO NO
title: Mulliken charges:
elementType: O O O N C C C C C C C C C C H H H H H H H H H H H H H
charge: -0.265013 -0.270347 -0.252427 -0.377642 -0.498529 -0.516960 0.132036 0.264763 0.251937 -0.361097 -0.214765 -0.276726 -0.226806 -0.672137 0.276950 0.237946 0.251318 0.285107 0.341782 0.252850 0.260240 0.250579 0.227284 0.227973 0.210828 0.231438 0.229419
chargesum: 0.00000
title: Mulliken charges with hydrogens summed into heavy atoms:
elementType: O O O N C C C C C C C C C C
charge: -0.265013 -0.270347 -0.252427 -0.035861 0.016366 0.019465 0.132036 0.264763 0.251937 -0.108247 0.045475 -0.026147 0.228451 -0.000452
polarizability: 1.91768991e+02 -1.07546674e+01 1.15773328e+02 -1.53035186e+00 3.45912114e+00 7.57862918e+01
1716.lowfreq: -8.4860 -1.3932 -0.0009 -0.0008 -0.0005 5.8295 20.4907 33.1250 39.0408
frequency: 20.4263 33.0726 39.0228 59.1329 93.3877 108.2214 130.2310 154.3133 177.5240 215.7548 227.4901 250.5298 325.0976 357.5357 441.3597 507.9017 531.2482 565.8327 601.2059 646.9018 680.3386 708.7646 744.8593 750.9523 799.4670 807.5801 820.3043 834.4018 875.3061 891.2577 919.9562 927.8191 1008.4965 1014.2317 1027.0578 1053.3916 1077.8827 1110.4572 1113.3233 1128.7357 1133.4928 1136.2969 1162.5064 1235.3700 1249.3608 1256.8299 1284.6814 1330.3801 1353.9289 1366.2473 1400.5984 1403.3853 1427.6872 1437.3743 1444.3860 1451.2277 1463.1210 1474.0429 1486.9080 1533.8034 1566.2065 1633.6222 2981.8977 2994.6744 2995.7680 3009.7971 3044.3381 3068.1730 3074.6838 3092.2296 3107.8367 3210.6880 3223.8287 3244.3280 3565.7323
redmass: 4.5875 3.6520 3.6540 3.0152 3.4547 3.3699 3.0088 2.5162 5.0380 4.4931 4.1424 1.3791 6.1670 3.6416 3.9787 4.6553 2.8507 3.4212 2.8301 5.1964 4.0636 1.1609 3.4800 1.2250 1.1017 1.9667 3.1348 1.4947 5.7227 1.3644 4.1939 4.5123 2.3186 2.1947 2.2574 1.3707 2.2658 2.4841 2.2219 1.6381 1.6118 1.5388 1.4864 1.2478 1.1365 1.4410 1.6001 2.0580 1.8390 1.8403 1.2719 5.1960 3.4476 2.1241 1.4034 1.1444 1.0401 1.0593 1.0698 4.2960 7.0845 9.5157 1.0634 1.0650 1.0359 1.0582 1.0944 1.1066 1.0954 1.0985 1.1025 1.0913 1.0973 1.1083 1.0811
irintensity: 1.2790 0.2810 0.9522 0.9046 0.2410 5.2238 1.6347 6.6607 0.4182 1.6162 38.1631 3.7418 1.6201 10.1125 2.6024 8.5767 5.5275 24.5855 13.5453 7.0836 2.7419 45.3186 3.2245 143.8938 5.6493 25.7674 16.2704 11.1832 2.3896 0.1190 3.7134 52.4114 8.3306 12.8760 74.6685 26.3012 1.5379 155.5097 6.4317 226.1158 70.4303 46.1943 71.2343 86.0865 0.2425 1.1437 12.1963 187.2498 10.9006 17.0179 15.9398 40.7816 89.6321 42.6957 35.6672 46.7106 11.7741 4.8502 13.8682 20.6324 256.9933 152.0927 19.0944 46.0101 20.5362 18.4496 7.8447 8.4713 10.4710 31.0038 44.8709 3.3314 2.0928 2.3214 82.5247
temp: 298.150 k
press: 1.00000 atm
elementType: 8 8 8 7 6 6 6 6 6 6 6 6 6 6 1 1 1 1 1 1 1 1 1 1 1 1 1
symmnumber: 1
zpe: 565990.4 jmol-1
zpe.correction: 0.215574 hartree
zpe.thermalcorrener: 0.230050 hartree
zpe.thermalcorrenthalpy: 0.230994 hartree
zpe.thermalcorrgfe: 0.171175 hartree
zpe.sumelectzpe: -668.243122 hartree
zpe.sumelectthermal: -668.228647 hartree
zpe.sumelectthermalent: -668.227702 hartree
zpe.sumelectthermalfe: -668.287521 hartree
dipole: 0.9413 -0.4628 -1.3939
dipole: 1.7445
quadrupole: -52.6257 -85.3113 -86.5247
quadrupole: 1.1537 1.6935 3.8293
quadrupole: 22.1949 -10.4907 -11.7041 1.1537 1.6935 3.8293
hfenergy: -668.4586962 hartree
pointgroup: C01 [X(C10H13N1O3)]
dipole: 0.3619273 0.0921875 0.5758095 debye
polarizability: 191.4928111|10.8446765|113.7340448|4.7252068|9.9405565|78.1017556 unknown
InChI: InChI=1S/C10H13NO3/c1-2-14-10(13)6-5-9(12)8-4-3-7-11-8/h3-4,7,11H,2,5-6H2,1H3
charge 0 multiplicity 1
27 atoms
O  -3.662406 -0.326241 0.098615
O  1.153453 -1.783355 -0.800224
O  -2.502863 1.359815 -1.0145
N  3.710124 -0.795895 -0.312292
C  0.019561 0.269238 -0.070141
C  -1.278918 -0.553672 -0.028338
C  1.249866 -0.600922 -0.323471
C  2.566723 -0.032398 -0.04113
C  -2.497691 0.281582 -0.372856
C  3.011137 1.209517 0.474867
C  4.844233 -0.081289 0.012985
C  4.438151 1.17784 0.507498
C  -4.947955 0.362017 -0.239512
C  -6.066934 -0.469801 0.37832
H  -0.055535 1.012625 -0.89051
H  0.154968 0.855284 0.85713
H  -1.433547 -1.041732 0.948923
H  -1.196552 -1.377854 -0.765477
H  3.641077 -1.740005 -0.697014
H  2.372615 2.035838 0.783969
H  5.84301 -0.492543 -0.119593
H  5.103393 1.969329 0.847855
H  -4.908498 1.389857 0.164378
H  -5.025718 0.428828 -1.339905
H  -7.045179 -0.005817 0.155676
H  -6.067325 -1.494797 -0.030009
H  -5.952992 -0.532249 1.474056
