program: Gaussian 09
title: 000258368
version: EM64L-G09RevD.01
frameworkgroup: C1[X(C12H9O3P)]
method: RPBEPBE
basis: SDD
operation: Freq
keyword: #p
keyword: freq=noraman
keyword: PBEPBE/SDD
title: #p freq=noraman PBEPBE/SDD
converged: NO YES NO NO
title: Mulliken charges:
elementType: P O O O C C C C C C C C C C C C H H H H H H H H H
charge: 1.110728 -0.279568 -0.653602 -0.605061 -0.267665 -0.267570 0.346289 0.346274 -0.282606 -0.282625 -0.351902 -0.351893 -0.238007 -0.238006 -0.197696 -0.197709 0.265609 0.265577 0.266373 0.266377 0.239949 0.239946 0.238838 0.238845 0.389104
chargesum: 0.00000
title: Mulliken charges with hydrogens summed into heavy atoms:
elementType: P O O O C C C C C C C C C C C C
charge: 1.110728 -0.279568 -0.264498 -0.605061 -0.267665 -0.267570 0.346289 0.346274 -0.016997 -0.017048 -0.085529 -0.085516 0.001942 0.001941 0.041142 0.041136
polarizability: 2.32707754e+02 1.41715378e-03 1.70093538e+02 -1.32089627e-03 -8.21700497e+00 7.62516151e+01
1716.lowfreq: -7.6275 -0.0013 -0.0004 0.0018 9.2470 9.5003 40.0424 75.3077 100.7320
frequency: 40.0413 75.2996 100.7295 105.3677 193.8706 196.0237 206.6043 224.2148 278.1274 294.4194 328.6156 338.6885 378.0153 419.0923 461.9395 473.6271 482.7151 520.2626 539.4182 596.7078 626.0326 650.9220 682.0707 688.9505 725.3862 739.8610 769.0353 772.0342 776.2008 869.8153 872.8351 872.8370 960.0671 960.4767 970.1848 991.9193 992.2568 1028.8707 1029.6889 1033.3155 1062.4203 1086.7063 1130.9251 1131.0414 1170.9684 1171.8362 1181.6348 1219.3718 1264.0774 1274.5072 1385.6002 1387.9263 1421.3653 1437.7529 1451.2624 1459.3695 1569.9348 1586.6947 1601.6011 1616.3992 3137.7776 3137.9236 3146.9009 3147.0380 3166.4193 3166.7135 3178.1174 3178.4544 3581.2791
redmass: 5.6664 6.7753 5.8401 3.3046 7.9002 5.4641 1.9235 6.7066 6.9178 1.9344 5.4790 6.8353 5.9516 7.4651 3.1825 12.1505 3.7072 3.6380 4.0749 7.7973 7.0712 7.9000 8.3470 7.2689 3.7701 4.5640 1.2763 1.2822 6.2413 6.7734 1.3991 1.4051 1.3704 1.3740 2.9090 1.3281 1.3292 2.6187 2.4132 1.9809 3.3935 3.4656 1.8371 1.7638 1.1246 1.0915 2.2037 2.5845 1.7248 1.4521 11.0778 10.5205 2.2476 2.4079 2.3062 2.3893 6.7142 7.2728 6.3524 6.7425 1.0873 1.0874 1.0901 1.0902 1.0945 1.0946 1.1001 1.1002 1.0657
irintensity: 1.8773 18.3610 1.0361 4.8061 11.5565 2.4869 50.8074 3.3399 14.3356 24.8419 1.3503 10.0127 1.7932 24.7378 0.7912 52.2922 22.9997 0.1540 1.1236 8.3846 1.8118 43.1886 132.5226 9.3935 0.4422 21.9285 151.2848 2.8373 31.0570 51.0583 0.4991 5.0998 0.0604 3.2409 19.6192 0.0633 0.7230 1.3633 3.2333 63.4952 52.8936 39.4572 0.1219 54.6037 1.7137 3.4704 7.1294 158.1460 171.3858 0.6408 13.6202 0.1433 162.7169 23.1806 93.1074 17.7783 15.0859 28.8219 65.4212 4.6857 0.7212 0.6780 4.3032 6.8191 18.5490 5.1290 25.1555 4.2582 59.1820
temp: 298.150 k
press: 1.00000 atm
elementType: 15 8 8 8 6 6 6 6 6 6 6 6 6 6 6 6 1 1 1 1 1 1 1 1 1
symmnumber: 1
zpe: 470841.5 jmol-1
zpe.correction: 0.179334 hartree
zpe.thermalcorrener: 0.192745 hartree
zpe.thermalcorrenthalpy: 0.193689 hartree
zpe.thermalcorrgfe: 0.139126 hartree
zpe.sumelectzpe: -1028.449352 hartree
zpe.sumelectthermal: -1028.435941 hartree
zpe.sumelectthermalent: -1028.434996 hartree
zpe.sumelectthermalfe: -1028.489560 hartree
dipole: -0.0008 -2.7985 0.5587
dipole: 2.8538
quadrupole: -74.1303 -95.4804 -109.4328
quadrupole: -0.0019 0.0013 6.3276
quadrupole: 18.8842 -2.4659 -16.4183 -0.0019 0.0013 6.3276
hfenergy: -1028.6286856 hartree
pointgroup: C01 [X(C12H9O3P1)]
dipole: 0.0082924 -1.1079602 -0.181468 debye
dipolederiv: 1.720336 -0.0020521 0.0005855 -0.0015107 1.7199964 -0.2179832 0.0011828 -0.2932342 1.5476652 -2.0857051 -0.0153499 0.013567 -0.0149943 -0.3231093 -0.0169482 0.0140748 -0.0754879 -0.1943763 -0.6683529 0.0023434 -0.0043771 0.0014284 -0.6238414 0.2565913 -0.0054113 0.3837389 -0.9786376 -0.6695473 0.0009675 0.0003719 0.0003825 -0.751148 -0.0303498 -0.0003105 0.0442075 -0.6568952 -0.4987988 -0.1415907 -0.004841 0.0825679 -0.4562214 0.0221147 -0.0470843 -0.0634737 -0.2798065 -0.4989478 0.1399389 0.0075566 -0.0829482 -0.455268 0.0234102 0.05129 -0.0646534 -0.280608 1.380565 -0.3145958 -0.0558197 -0.4165444 0.2398427 -0.0172564 -0.119983 0.0479165 0.1485883 1.3701887 0.3342717 0.0387355 0.4352441 0.2524381 -0.0224992 0.1018221 0.0451815 0.1463573 0.0482728 0.1611038 -0.0099358 -0.1765499 0.0732095 0.0289799 -0.020579 0.0127809 -0.0687771 0.0484492 -0.1613549 0.0078112 0.1765661 0.0735088 0.0265789 0.0186524 0.0153074 -0.0691944 -0.476396 0.0746047 0.0090208 -0.1220509 0.0376415 0.0349393 0.0159394 0.0168916 -0.1605296 -0.4773923 -0.0829994 -0.0050948 0.1139883 0.0382934 0.0331337 -0.0117733 0.0177461 -0.1602337 -0.0050311 -0.1521208 -0.0387632 -0.0036437 -0.1971043 0.0098992 -0.0148743 0.0205423 -0.1559394 -0.006987 0.1556016 0.0364307 0.0069305 -0.1944654 0.0104469 0.012421 0.0186037 -0.1566681 0.1931542 -0.0009867 -0.0279195 -0.0105375 0.1718572 0.0200227 -0.040993 0.0225436 -0.1216896 0.1938905 0.0016804 0.0231074 0.0111975 0.1721028 0.0202595 0.0361555 0.023138 -0.1225958 0.1110002 -0.0113135 0.0003879 0.0403802 -0.0154685 -0.0167456 0.0063529 -0.0156703 0.1388824 0.1113307 0.0132066 0.0002774 -0.0384959 -0.0159842 -0.0161608 -0.005669 -0.0159049 0.138974 0.0920719 0.0374805 0.0138324 0.0138693 -0.0329307 -0.0156651 0.0043008 -0.0167884 0.1735782 0.0926599 -0.0356209 -0.0124151 -0.0119951 -0.033745 -0.0156767 -0.0028847 -0.0163059 0.1738151 -0.0918823 0.0479697 0.034095 0.0618313 0.0631924 -0.0166329 0.0361438 -0.0187638 0.1632806 -0.0909415 -0.0508159 -0.0301814 -0.0646414 0.0612996 -0.0162564 -0.0322048 -0.0186169 0.1642272 -0.042327 -0.0994955 0.0110982 -0.106474 0.0163548 -0.0002806 0.0161369 -0.0013323 0.1530352 -0.0460822 0.0984146 -0.0082822 0.1054132 0.0197879 -0.0019323 -0.0133099 -0.0029713 0.1533838 0.2964721 0.0007127 0.0007523 0.0005868 0.159761 -0.0819893 0.0006046 -0.065395 0.304164 unknown
polarizability: 232.6948918|0.5526428|170.5554137|-1.1592149|4.9326939|75.8026013 unknown
InChI: InChI=1S/C12H9O3P/c13-16(14)11-7-3-1-5-9(11)15-10-6-2-4-8-12(10)16/h1-8,13H
charge 0 multiplicity 1
25 atoms
P  -0.044382 1.613379 -0.129248
O  -0.018561 -1.59142 -0.28424
O  -0.060316 2.076614 -1.824443
O  -0.049108 2.924935 0.798133
C  -1.453923 0.446834 0.000394
C  1.386254 0.470692 -0.019799
C  -1.265144 -0.952767 -0.118116
C  1.219323 -0.931877 -0.13576
C  -2.762898 0.95168 0.202262
C  2.689376 0.997355 0.163326
C  -2.369947 -1.834322 -0.07309
C  2.339233 -1.794839 -0.106449
C  -3.866124 0.080953 0.26005
C  3.807735 0.145213 0.205373
C  -3.663964 -1.315081 0.110871
C  3.626878 -1.254037 0.059096
H  -2.896535 2.032824 0.321328
H  2.806636 2.080613 0.280356
H  -2.187584 -2.908008 -0.173265
H  2.173388 -2.871443 -0.204029
H  -4.873537 0.478622 0.41573
H  4.810467 0.559725 0.346706
H  -4.517313 -2.000338 0.148539
H  4.492005 -1.924939 0.084632
H  -0.069356 3.064634 -1.917156
