program: Gaussian 09
title: 000258349
version: EM64L-G09RevD.01
frameworkgroup: C1[X(C13H18N2O2)]
method: RPBEPBE
basis: SDD
operation: Freq
keyword: #p
keyword: freq=noraman
keyword: PBEPBE/SDD
title: #p freq=noraman PBEPBE/SDD
converged: YES YES NO NO
title: Mulliken charges:
elementType: O O N N C C C C C C C C C C C C C H H H H H H H H H H H H H H H H H H
charge: -0.266157 -0.259784 -0.437836 -0.446097 -0.213692 0.395293 0.277423 -0.683270 -0.683306 -0.377397 -0.644615 0.546677 -0.442921 0.211361 0.206450 -0.804592 -0.800680 0.167045 0.227323 0.221068 0.212390 0.227341 0.212390 0.221047 0.227740 0.302782 0.307763 0.295272 0.317966 0.236620 0.268725 0.236626 0.237306 0.266430 0.237310
chargesum: 0.00000
title: Mulliken charges with hydrogens summed into heavy atoms:
elementType: O O N N C C C C C C C C C C C C C
charge: -0.266157 -0.259784 -0.142565 -0.128131 -0.046648 0.395293 0.277423 -0.022489 -0.022528 -0.149657 -0.341833 0.546677 -0.135158 0.211361 0.206450 -0.062621 -0.059634
polarizability: 2.35264351e+02 3.83339788e-01 1.91113275e+02 3.44367147e-04 8.72441013e-04 9.50244856e+01
1716.lowfreq: -86.3716 -82.9091 -27.3283 -7.4136 -7.3481 -0.0012 -0.0008 -0.0003 1.6486
frequency: -86.3684 -82.9059 -26.6090 48.2079 52.5618 58.3994 94.5126 95.4703 121.4268 134.2297 209.0094 210.3106 239.6494 242.5562 249.9956 262.9601 270.2604 341.1288 347.7944 395.7827 418.0852 477.2748 495.3625 513.2268 561.0810 569.8886 580.4512 616.2001 625.5110 653.1637 654.5094 674.3778 730.4401 757.6296 792.4392 855.9058 878.5417 899.1678 910.0699 925.2806 935.2241 951.8031 959.1741 981.2038 986.2372 1017.4755 1029.3016 1030.2280 1057.1321 1085.6207 1113.3828 1162.7235 1186.1832 1205.4615 1228.0137 1251.5767 1265.2040 1271.7703 1311.9570 1334.6022 1373.2467 1375.1910 1378.8914 1384.7820 1395.4607 1404.5854 1441.3265 1450.8505 1463.4584 1467.5693 1467.7711 1468.9860 1469.3727 1476.8890 1485.8988 1510.9334 1527.9774 1596.5019 1625.1268 1630.6197 1633.9920 2947.0850 2977.2758 2979.8407 2987.2969 2988.1511 3071.9196 3072.5567 3073.2130 3077.3562 3080.7538 3085.2659 3130.6283 3136.5086 3136.5641 3152.4200 3199.6333 3519.4266 3528.9197
redmass: 1.0455 1.0443 2.6975 4.9734 4.2662 4.9024 3.8288 4.6786 3.5997 3.5693 4.0736 1.1341 2.6713 1.7708 1.6074 4.2603 4.9223 3.7728 3.5048 3.3420 3.6997 3.9600 3.2230 3.7016 3.7432 3.0929 3.0928 3.8004 1.8132 5.5479 1.2571 1.6807 3.9002 3.6178 5.0709 1.3919 3.2116 3.5081 1.1480 1.4950 6.0282 1.4868 2.4725 1.3197 1.5712 2.2104 1.6572 1.6615 1.4783 2.5902 2.4607 1.8046 1.5558 1.7809 3.0151 2.0861 2.0681 1.3733 2.3237 1.9487 1.2319 1.2334 1.1899 2.6213 1.3637 2.7261 1.3791 1.1272 1.0456 1.0471 1.0468 1.6332 1.0495 1.0525 1.0747 2.4545 2.1485 5.2278 6.2359 4.5665 5.3140 1.0809 1.0349 1.0357 1.0383 1.0383 1.1003 1.0984 1.0983 1.0998 1.1006 1.0998 1.0895 1.0980 1.0979 1.0926 1.0948 1.0765 1.0755
irintensity: 0.0115 0.0698 0.1116 1.0229 0.0643 20.0608 2.1584 7.1266 0.3605 1.5682 2.7509 0.0962 0.2265 0.4598 0.3926 1.4862 4.5938 1.4839 3.1917 0.1734 0.8082 7.5231 13.1264 18.1896 9.5579 1.3078 0.7575 0.7183 4.8502 1.4016 118.9459 10.5324 0.8024 0.4382 0.0934 35.9701 2.3649 3.8253 1.6182 56.0051 7.7980 0.3002 21.4491 2.0051 8.7418 29.9492 6.7356 8.6055 13.7621 6.0337 2.7054 1.4734 9.6866 18.7881 32.4056 118.3516 4.4815 1.0628 9.5731 115.8997 48.3804 39.0904 16.1363 192.5893 26.6416 277.3283 125.7073 15.5479 3.9794 19.5445 17.3483 41.1686 5.1063 15.9867 7.8278 422.2451 200.9637 145.9356 159.2955 109.5526 75.5066 62.3457 29.3698 38.9027 9.4871 8.8241 1.2201 14.1482 16.0958 90.4449 20.7626 40.2321 21.2272 8.2754 7.5702 19.6351 5.9706 13.5175 35.7655
temp: 298.150 k
press: 1.00000 atm
elementType: 8 8 7 7 6 6 6 6 6 6 6 6 6 6 6 6 6 1 1 1 1 1 1 1 1 1 1 1 1 1 1 1 1 1 1
symmnumber: 1
zpe: 756646.3 jmol-1
zpe.correction: 0.288191 hartree
zpe.thermalcorrener: 0.304299 hartree
zpe.thermalcorrenthalpy: 0.305244 hartree
zpe.thermalcorrgfe: 0.244210 hartree
zpe.sumelectzpe: -764.899877 hartree
zpe.sumelectthermal: -764.883769 hartree
zpe.sumelectthermalent: -764.882825 hartree
zpe.sumelectthermalfe: -764.943858 hartree
dipole: -4.1741 0.8881 0.0003
dipole: 4.2675
quadrupole: -86.7028 -107.1736 -104.5990
quadrupole: 13.6025 0.0005 0.0007
quadrupole: 12.7890 -7.6818 -5.1072 13.6025 0.0005 0.0007
hfenergy: -765.188068 hartree
pointgroup: C01 [X(C13H18N2O2)]
dipole: 1.6590451 -0.257965 -0.0002402 debye
polarizability: 235.0866415|2.8215527|191.290978|-0.0294699|0.0030965|95.024492 unknown
InChI: InChI=1S/C13H18N2O2/c1-8(2)12-6-5-11(14-9(3)16)7-13(12)15-10(4)17/h5-8,14-15H,1-4H3
charge 0 multiplicity 1
35 atoms
O  1.302551 -3.237638 -0.000195
O  -4.279108 1.016269 0.001367
N  2.15322 -1.040216 -0.0002
N  -2.720587 -0.741948 0.000966
C  2.446798 1.940611 -0.000196
C  1.103759 1.193152 0.000077
C  0.974452 -0.234245 0.000068
C  2.6175 2.803082 1.28053
C  2.616311 2.804414 -1.28018
C  -0.093749 1.94718 0.000473
C  -0.306531 -0.83848 0.000358
C  -1.478039 -0.04499 0.0007
C  -1.377441 1.369672 0.000783
C  2.280162 -2.43056 -0.000301
C  -4.017142 -0.222497 0.001288
C  3.733936 -2.909464 -0.00059
C  -5.107326 -1.296463 0.001444
H  3.292709 1.221226 -0.001007
H  2.536463 2.18518 2.192657
H  1.837851 3.583962 1.335375
H  3.602189 3.306563 1.283596
H  2.534469 2.187446 -2.192865
H  3.600988 3.307915 -1.283606
H  1.83661 3.585339 -1.33352
H  -0.023128 3.041292 0.00054
H  -0.362025 -1.930944 0.000318
H  -2.28098 1.980274 0.001069
H  3.033041 -0.52093 -0.000329
H  -2.642613 -1.762333 0.00089
H  4.275289 -2.551572 -0.896043
H  3.739602 -4.008616 -0.00076
H  4.275538 -2.551854 0.894826
H  -5.035865 -1.941941 -0.89368
H  -6.087592 -0.799171 0.001576
H  -5.035614 -1.941913 0.896568
