program: Gaussian 09
title: 000258338
version: EM64L-G09RevD.01
frameworkgroup: C1[X(C9H17NO3)]
method: RPBEPBE
basis: SDD
operation: Freq
keyword: #p
keyword: freq=noraman
keyword: PBEPBE/SDD
title: #p freq=noraman PBEPBE/SDD
converged: NO YES NO NO
title: Mulliken charges:
elementType: O O O N C C C C C C C C C H H H H H H H H H H H H H H H H H
charge: -0.419012 -0.255679 -0.229620 -0.621167 -0.384640 -0.368596 -0.366313 -0.370705 -0.376025 -0.537371 -0.487145 0.224335 0.170914 0.199258 0.199217 0.186057 0.186063 0.189624 0.189741 0.221908 0.221276 0.219019 0.218532 0.233224 0.233722 0.251778 0.251610 0.331887 0.313096 0.375014
chargesum: 0.00000
title: Mulliken charges with hydrogens summed into heavy atoms:
elementType: O O O N C C C C C C C C C
charge: -0.043999 -0.255679 -0.229620 0.023815 0.013836 0.003524 0.013052 0.072479 0.061526 -0.070424 0.016243 0.224335 0.170914
polarizability: 1.51043616e+02 2.88078895e+00 1.10088574e+02 1.15822750e-01 3.14572955e-02 7.85945667e+01
1716.lowfreq: -28.3400 -2.6171 0.0004 0.0007 0.0011 7.4228 15.7948 26.5578 38.1024
frequency: -23.5928 26.3282 37.6271 38.1066 60.0678 85.8313 102.8492 104.3301 144.2738 148.5613 160.5439 207.0963 282.7844 357.0238 406.5471 469.0986 481.5145 499.5391 500.6275 515.6710 581.5024 594.5896 626.9599 635.0944 725.6503 730.3645 763.6523 824.9470 834.4700 856.1935 900.7914 987.7067 995.7902 1009.3059 1037.1937 1048.9761 1075.7368 1080.5462 1083.8311 1103.1498 1106.9686 1119.8490 1205.3868 1208.0634 1233.5507 1247.0512 1254.9411 1280.9295 1283.4677 1286.6533 1296.9187 1300.8500 1318.8643 1347.8509 1361.5920 1368.9394 1372.8122 1437.8222 1445.5232 1462.8548 1465.0822 1469.9865 1480.3816 1489.1626 1596.5425 1646.0735 1670.8435 2948.4425 2952.2895 2963.7039 2966.1907 2987.0140 2987.7956 2997.0900 2997.3980 3001.3269 3012.0651 3027.2995 3034.6365 3062.9185 3066.0373 3511.9180 3514.6846 3671.9079
redmass: 4.7035 5.2720 2.5977 5.5583 3.0001 1.8423 5.1234 2.4196 1.9323 2.1161 7.7574 4.5515 4.8217 4.2125 3.7778 3.2682 1.3631 2.0561 2.5005 1.2840 4.6810 4.3011 1.4342 1.3293 1.0708 1.1306 1.2679 1.3950 3.2701 4.7913 1.4096 1.2943 4.2043 4.4573 2.4577 2.5400 2.4059 2.5289 2.0736 1.5196 3.5942 1.3405 1.5296 1.2867 1.4204 1.3066 1.5297 1.1403 1.0531 1.5921 1.0853 1.1149 1.6959 1.7536 1.6634 2.1243 1.8338 1.0842 1.0846 1.0758 1.0628 1.0888 1.0969 1.1001 1.3811 3.9762 8.2492 1.0589 1.0588 1.0591 1.0593 1.0611 1.0974 1.1003 1.0602 1.0602 1.0993 1.1014 1.1019 1.1034 1.1035 1.0639 1.0444 1.1044
irintensity: 4.9590 0.0954 0.0715 0.5322 0.0162 0.0866 7.4014 0.4279 0.1720 0.0011 0.2954 3.4639 9.1716 6.9488 3.2190 5.8044 24.9041 25.9635 21.2334 218.1294 21.2100 1.2625 64.4976 129.0633 22.1033 0.1242 10.6717 0.0132 0.8105 1.4185 4.8163 0.0266 101.4001 8.5296 128.6886 23.4088 0.6346 28.5280 1.7243 0.6757 19.4521 0.2805 0.0147 11.7010 16.3235 0.0226 45.5358 0.4131 0.3108 7.5181 0.2391 0.0066 113.6947 6.9045 5.5960 105.3287 6.1002 27.3053 13.6382 0.4456 0.2083 4.6806 0.8294 25.6932 68.2379 274.4555 212.0867 5.8100 19.4079 16.5423 66.6291 5.3051 9.1082 0.6386 32.8902 33.6173 12.3482 19.8949 18.1317 17.1520 131.8680 17.7530 25.4911 21.0152
temp: 298.150 k
press: 1.00000 atm
elementType: 8 8 8 7 6 6 6 6 6 6 6 6 6 1 1 1 1 1 1 1 1 1 1 1 1 1 1 1 1 1
symmnumber: 1
zpe: 667435.8 jmol-1
zpe.correction: 0.254213 hartree
zpe.thermalcorrener: 0.269129 hartree
zpe.thermalcorrenthalpy: 0.270073 hartree
zpe.thermalcorrgfe: 0.209411 hartree
zpe.sumelectzpe: -632.561531 hartree
zpe.sumelectthermal: -632.546615 hartree
zpe.sumelectthermalent: -632.545671 hartree
zpe.sumelectthermalfe: -632.606333 hartree
dipole: -1.1588 -5.3654 -0.0260
dipole: 5.4892
quadrupole: -63.7117 -88.2721 -78.3576
quadrupole: 15.6157 0.2879 0.0581
quadrupole: 13.0688 -11.4916 -1.5771 15.6157 0.2879 0.0581
hfenergy: -632.8157435 hartree
pointgroup: C01 [X(C9H17N1O3)]
dipole: 0.445647 2.1131226 0.0006066 debye
polarizability: 151.0147611|3.0802213|110.1171407|0.0014684|0.1248479|78.5948546 unknown
InChI: InChI=1S/C9H17NO3/c10-8(11)6-4-2-1-3-5-7-9(12)13/h12H,1-7,10H2
charge 0 multiplicity 1
30 atoms
O  -6.26323 0.640767 -0.001932
O  5.159689 -1.421831 0.007671
O  -5.228114 -1.437122 -0.035612
N  6.314788 0.585614 -0.00358
C  0.001192 -0.199313 -0.006001
C  1.285454 0.66027 -0.001602
C  -1.295187 0.641519 -0.003967
C  2.575932 -0.187807 -0.00373
C  -2.573515 -0.225075 -0.009107
C  3.849016 0.679206 0.000634
C  -3.853722 0.631421 -0.006439
C  5.139958 -0.156956 0.002147
C  -5.127276 -0.191605 -0.016685
H  0.005881 -0.868913 0.878793
H  0.007395 -0.862182 -0.895847
H  1.278137 1.330124 -0.887777
H  1.276695 1.323237 0.889728
H  -1.297173 1.311324 -0.889824
H  -1.299126 1.304093 0.887294
H  2.590377 -0.858082 0.876237
H  2.591534 -0.851459 -0.888746
H  -2.575649 -0.887401 -0.895841
H  -2.577118 -0.895363 0.871676
H  3.856961 1.346412 -0.886024
H  3.853248 1.342192 0.890521
H  -3.888329 1.295397 0.879788
H  -3.882979 1.307208 -0.884072
H  7.205415 0.088595 -0.00235
H  6.312158 1.604069 -0.008794
H  -7.080711 0.071756 -0.010163
