program: Gaussian 09
title: 000258328
version: EM64L-G09RevD.01
frameworkgroup: C1[X(C12H15ClN2O)]
method: RPBEPBE
basis: SDD
operation: Freq
keyword: #p
keyword: freq=noraman
keyword: PBEPBE/SDD
title: #p freq=noraman PBEPBE/SDD
converged: YES YES NO NO
title: Mulliken charges:
elementType: Cl O N N C C C C C C C C C C C C H H H H H H H H H H H H H H H
charge: -0.059360 -0.291092 -0.172600 -0.110280 -0.392661 -0.388420 -0.374912 -0.389739 0.535889 0.233231 -0.298175 -0.342723 -0.794643 -0.218888 -0.237608 -0.245195 0.222837 0.242212 0.235922 0.198681 0.233228 0.260683 0.229451 0.228187 0.244417 0.230173 0.269572 0.235077 0.253496 0.228124 0.235115
chargesum: 0.00000
title: Mulliken charges with hydrogens summed into heavy atoms:
elementType: Cl O N N C C C C C C C C C C C C
charge: -0.059360 -0.291092 -0.172600 -0.110280 0.072389 0.046183 0.118999 0.067900 0.535889 0.233231 -0.298175 -0.098306 -0.059822 0.034608 -0.009484 -0.010080
polarizability: 2.21511509e+02 -9.47934278e+00 1.55710004e+02 1.35686471e+00 1.61477638e+00 9.38661725e+01
1716.lowfreq: -10.1731 -0.0014 -0.0006 0.0003 2.1932 4.9495 30.6149 55.5957 72.9197
frequency: 30.6023 55.5511 72.9141 78.9815 108.5299 148.5468 172.9315 215.3380 220.6456 229.8186 290.5359 304.3609 308.2324 365.4387 401.9355 428.2158 444.8845 458.4022 485.7298 499.4225 548.0519 566.4755 573.4513 617.0209 654.5938 699.7362 712.1381 728.2344 753.0338 841.9182 846.7096 900.8099 927.2249 934.0023 966.8055 971.5337 992.0686 1008.4424 1028.2714 1035.6830 1047.9115 1058.1709 1061.1302 1110.0393 1120.4731 1150.6820 1172.2154 1202.8125 1206.6421 1227.3890 1250.2374 1262.2810 1281.3608 1334.9260 1343.7270 1351.0723 1363.2793 1367.3950 1374.2460 1374.8562 1420.1837 1427.9055 1449.8765 1457.7838 1460.7671 1462.8282 1465.7620 1479.2986 1480.7768 1561.1822 1593.4025 1605.5943 2887.6730 2919.7044 2972.0277 2988.3093 2990.0385 3055.7963 3074.4336 3092.9355 3096.0182 3103.5164 3131.4334 3133.1441 3149.5037 3158.9830 3175.1770
redmass: 5.6586 4.6363 5.1552 4.8606 3.3361 4.3675 1.0698 4.2299 5.4669 5.8501 3.2091 2.1574 3.5594 4.9244 2.2796 3.5273 3.2499 2.8756 4.3610 3.9209 3.5547 3.5170 4.4846 3.0117 4.4254 3.1019 3.6836 4.2493 1.3125 1.4378 1.5217 3.7735 1.6745 2.0105 2.3056 1.3831 1.8486 6.0029 1.6767 2.5731 1.7534 1.9890 2.1115 2.1211 1.9403 3.0761 1.0786 1.0761 3.1466 1.5165 1.6416 1.5701 1.5013 1.2609 1.4458 1.7660 1.7983 2.0197 1.2229 1.7429 2.9013 2.4366 1.0815 1.1004 1.1093 1.1454 1.1218 1.4713 1.5098 5.9556 6.6213 6.8911 1.0695 1.0719 1.0686 1.0384 1.0657 1.0912 1.0984 1.0968 1.0934 1.0899 1.0977 1.0855 1.0894 1.0946 1.1003
irintensity: 0.8623 2.2236 0.8568 0.9151 4.5225 0.9418 1.1324 5.0503 2.8582 1.6342 8.1380 8.5510 1.6440 4.3215 0.4957 8.6075 6.3115 2.6154 2.9464 3.9855 4.2739 8.2567 3.0572 3.7189 23.3849 4.0980 2.8339 7.3186 92.5954 0.2675 0.5906 18.4384 3.9256 6.9938 26.6648 2.2736 75.2789 45.5995 3.2909 28.8376 1.4415 2.3361 2.2119 4.2435 12.0421 22.1351 0.7424 6.5755 17.5673 218.1515 36.9730 28.6180 34.9094 0.2305 4.2636 24.8064 8.2089 12.6681 27.3906 23.2365 202.9700 8.0737 36.3883 20.7047 33.3340 53.6119 11.7940 53.2786 64.5851 2.2571 319.1038 57.8397 68.4989 66.1725 42.0668 10.5547 40.9589 26.6414 17.8087 7.7428 21.4310 4.7377 11.3653 5.3804 9.4571 15.8535 13.9472
temp: 298.150 k
press: 1.00000 atm
elementType: 17 8 7 7 6 6 6 6 6 6 6 6 6 6 6 6 1 1 1 1 1 1 1 1 1 1 1 1 1 1 1
symmnumber: 1
zpe: 658437.3 jmol-1
zpe.correction: 0.250786 hartree
zpe.thermalcorrener: 0.265744 hartree
zpe.thermalcorrenthalpy: 0.266688 hartree
zpe.thermalcorrgfe: 0.207859 hartree
zpe.sumelectzpe: -1109.868078 hartree
zpe.sumelectthermal: -1109.853120 hartree
zpe.sumelectthermalent: -1109.852176 hartree
zpe.sumelectthermalfe: -1109.911005 hartree
dipole: 2.0715 -4.1948 1.5383
dipole: 4.9248
quadrupole: -109.3039 -97.4329 -105.1700
quadrupole: 8.7186 -11.6694 0.4729
quadrupole: -5.3350 6.5360 -1.2011 8.7186 -11.6694 0.4729
hfenergy: -1110.1188635 hartree
pointgroup: C01 [X(C12H15Cl1N2O1)]
dipole: -0.9098976 1.3669467 1.0284492 debye
polarizability: 222.3374292|-5.8610538|150.8204287|-1.0996983|15.3348882|97.9298278 unknown
InChI: InChI=1S/C12H15ClN2O/c1-10(16)14-6-8-15(9-7-14)12-5-3-2-4-11(12)13/h2-5H,6-9H2,1H3
charge 0 multiplicity 1
31 atoms
Cl -1.921741 -2.619307 -0.266888
O  4.48727 -0.615511 -1.122528
N  -0.240547 0.013342 0.084365
N  2.609232 -0.24452 0.197464
C  0.504591 -0.576536 -1.06235
C  0.558857 1.026866 0.79984
C  1.809405 -1.224544 -0.569829
C  1.874701 0.387678 1.306565
C  -1.643174 0.195858 -0.016078
C  3.943258 -0.018145 -0.140634
C  -2.543718 -0.89421 -0.215435
C  -2.243113 1.48441 0.126666
C  4.729729 0.977713 0.714779
C  -3.935119 -0.721462 -0.308783
C  -3.639321 1.668753 0.062692
C  -4.495023 0.569537 -0.16965
H  0.744069 0.21936 -1.804532
H  -0.118105 -1.335502 -1.558231
H  -0.014376 1.394962 1.668762
H  0.808991 1.897936 0.147102
H  1.562261 -2.088711 0.078012
H  2.429092 -1.56782 -1.414022
H  2.494813 1.160114 1.786727
H  1.619498 -0.379589 2.066253
H  -1.59445 2.355098 0.266424
H  4.312012 1.999339 0.649596
H  5.759646 0.996164 0.329981
H  4.753615 0.682724 1.779637
H  -4.575509 -1.595661 -0.459745
H  -4.055542 2.675693 0.176189
H  -5.5795 0.702573 -0.231447
