program: Gaussian 09
title: 000258337
version: EM64L-G09RevD.01
frameworkgroup: C1[X(C14H10N2O6)]
method: RPBEPBE
basis: SDD
operation: Freq
keyword: #p
keyword: freq=noraman
keyword: PBEPBE/SDD
title: #p freq=noraman PBEPBE/SDD
converged: YES YES NO NO
title: Mulliken charges:
elementType: O O O O O O N N C C C C C C C C C C C C C C H H H H H H H H H H
charge: -0.313174 -0.220598 -0.185686 -0.180493 -0.180652 -0.181589 0.021481 0.023326 0.290400 -0.480152 -0.461583 0.439093 0.431074 0.404497 -0.489816 0.467293 -0.447625 0.165383 -0.416493 -0.434509 -0.182023 -0.801186 0.329742 0.326541 0.341186 0.302427 0.259309 0.238971 0.235097 0.237351 0.224887 0.237520
chargesum: 0.00000
title: Mulliken charges with hydrogens summed into heavy atoms:
elementType: O O O O O O N N C C C C C C C C C C C C C C
charge: -0.313174 -0.220598 -0.185686 -0.180493 -0.180652 -0.181589 0.021481 0.023326 0.290400 -0.150410 -0.135042 0.439093 0.431074 0.404497 -0.148629 0.467293 -0.145198 0.165383 -0.157183 -0.195537 0.053074 -0.101428
polarizability: 3.18177069e+02 -6.08371690e+00 2.28030639e+02 7.14286564e-02 -2.28338264e-01 7.45402758e+01
1716.lowfreq: -2.4898 -0.0001 0.0006 0.0009 6.6208 8.2902 19.6271 27.8744 32.9123
frequency: 19.4226 27.8673 32.8907 50.3902 50.4818 51.2931 68.8736 113.3249 128.4028 151.9028 189.3307 197.5245 197.6613 211.0884 263.2498 288.4911 315.0590 333.0154 352.7789 391.4460 438.4104 453.5068 465.8821 471.9231 505.9539 513.3957 550.4273 560.4387 600.3006 633.0560 683.6898 691.9096 698.2161 699.3108 718.2121 724.5133 735.3000 760.4901 793.5260 858.5285 868.7170 896.1042 919.3578 927.5094 973.6793 978.9655 983.1282 985.7999 987.8401 991.8118 1003.1223 1052.1210 1067.3772 1084.8192 1094.7271 1108.4615 1134.7438 1176.1326 1204.9767 1206.9115 1232.3619 1238.9555 1255.0060 1302.7257 1380.8405 1381.3266 1384.3738 1401.6206 1405.5676 1424.5053 1436.6436 1460.3553 1470.3534 1475.3807 1481.2916 1587.0216 1594.5695 1608.4596 1616.9744 1627.8206 2982.3396 3061.8499 3091.6216 3134.3217 3153.8323 3174.4132 3179.9755 3192.2468 3194.4089 3203.3238
redmass: 4.3261 6.9441 1.0548 7.3774 15.4563 15.2403 9.2099 9.5126 8.4553 7.2987 4.7423 7.5818 5.3627 3.1107 5.4745 5.6514 9.3438 11.7312 8.6703 3.8949 2.8832 8.0610 5.6670 5.5302 8.9607 5.1347 7.6459 3.8819 5.4625 6.6710 12.2311 2.2564 2.8281 10.6817 7.2539 9.0831 6.1586 13.1678 1.4210 7.6599 10.5768 1.2962 4.1811 1.3695 1.4318 1.5921 1.3550 5.7723 6.0566 1.4121 1.5724 1.5611 1.5434 1.7149 1.4836 2.6090 2.5439 1.1142 9.8367 13.8787 1.3076 3.0939 6.9360 1.2964 7.5829 9.1914 10.1642 1.2694 5.2964 2.5561 5.7390 4.2022 1.0449 1.6452 1.5256 8.2728 6.1782 6.5693 8.2565 11.3033 1.0374 1.0977 1.0990 1.0878 1.0928 1.0984 1.0926 1.0928 1.0928 1.0926
irintensity: 0.0002 0.1428 0.4771 0.0082 0.0015 0.0002 0.6703 10.7104 3.6772 1.3769 0.0119 1.2633 0.3246 1.7300 0.1391 0.8175 4.9667 0.2704 4.6729 0.5625 6.1362 7.0162 0.0028 0.0146 3.2326 3.7365 4.4037 0.0238 1.0437 1.8057 43.2256 15.6877 48.3171 34.8437 5.4259 0.0015 11.3989 2.3225 57.7801 0.1980 19.0730 2.2938 30.4904 14.5360 13.7570 26.3798 2.7759 6.4157 0.0687 6.3384 3.0357 15.3979 115.8529 3.7127 14.5270 218.9582 238.1230 0.1899 315.5548 352.7416 2.4024 51.0464 47.2304 6.5558 7.9789 32.3142 149.8299 19.2980 6.4378 20.0015 16.1591 31.0116 14.3357 17.2269 62.5602 2.3085 26.5054 17.2061 8.7776 170.4378 26.7340 16.8726 19.4701 6.8849 21.6172 6.6394 14.5440 31.0277 3.7707 8.0102
temp: 298.150 k
press: 1.00000 atm
elementType: 8 8 8 8 8 8 7 7 6 6 6 6 6 6 6 6 6 6 6 6 6 6 1 1 1 1 1 1 1 1 1 1
symmnumber: 1
zpe: 578826.8 jmol-1
zpe.correction: 0.220463 hartree
zpe.thermalcorrener: 0.239869 hartree
zpe.thermalcorrenthalpy: 0.240813 hartree
zpe.thermalcorrgfe: 0.168852 hartree
zpe.sumelectzpe: -1098.622484 hartree
zpe.sumelectthermal: -1098.603078 hartree
zpe.sumelectthermalent: -1098.602134 hartree
zpe.sumelectthermalfe: -1098.674095 hartree
dipole: -5.7925 0.4267 0.0031
dipole: 5.8082
quadrupole: -127.5284 -145.0996 -125.4600
quadrupole: 0.8098 -0.1791 -0.2044
quadrupole: 5.1676 -12.4036 7.2360 0.8098 -0.1791 -0.2044
hfenergy: -1098.8429471 hartree
pointgroup: C01 [X(C14H10N2O6)]
dipole: -2.2763275 -0.1877823 0.069236 debye
polarizability: 317.667753|12.4435631|133.8426897|1.9248593|-74.43085|169.23754 unknown
InChI: InChI=1S/C14H10N2O6/c1-9-3-2-4-13(5-9)22-14(17)10-6-11(15(18)19)8-12(7-10)16(20)21/h2-8H,1H3
charge 0 multiplicity 1
32 atoms
O  -1.468014 -0.300533 0.236653
O  -1.044333 1.153505 -1.571727
O  2.080447 -2.204012 2.876184
O  3.715714 2.184178 -2.539322
O  4.264637 -1.728055 2.415768
O  5.378652 1.261692 -1.276702
N  3.001317 -1.615445 2.193854
N  4.13906 1.4398 -1.577869
C  0.78873 0.226566 -0.273116
C  1.755196 0.900697 -1.057094
C  1.195631 -0.602349 0.798298
C  2.571653 -0.740275 1.063345
C  3.117878 0.729903 -0.751223
C  -2.902783 -0.355863 0.194179
C  3.561408 -0.086668 0.305945
C  -5.125549 0.166684 -0.66588
C  -3.714541 0.316562 -0.743741
C  -0.655567 0.428876 -0.628404
C  -3.44696 -1.173695 1.208859
C  -5.680124 -0.651546 0.348809
C  -4.846027 -1.316485 1.278922
C  -6.011708 0.884847 -1.668952
H  1.443155 1.542177 -1.886476
H  0.461853 -1.128497 1.411808
H  4.624755 -0.207016 0.527832
H  -3.268095 0.942898 -1.517944
H  -2.779375 -1.676525 1.914459
H  -6.767746 -0.769008 0.412252
H  -5.286647 -1.946505 2.058599
H  -5.776352 0.575559 -2.70427
H  -7.079254 0.674704 -1.487568
H  -5.868012 1.980132 -1.617477
