program: Gaussian 09
title: 000258332
version: EM64L-G09RevD.01
frameworkgroup: C1[X(C13H19N3O)]
method: RPBEPBE
basis: SDD
operation: Freq
keyword: #p
keyword: freq=noraman
keyword: PBEPBE/SDD
title: #p freq=noraman PBEPBE/SDD
converged: YES YES NO NO
title: Mulliken charges:
elementType: O N N N C C C C C C C C C C C C C H H H H H H H H H H H H H H H H H H H
charge: -0.263287 -0.079384 -0.174969 -0.619480 -0.358216 -0.362882 -0.407490 -0.384634 -0.335471 0.469743 -0.528600 -0.377177 -0.380983 0.230761 -0.235277 -0.226488 -0.269029 0.200917 0.186299 0.187400 0.216091 0.214476 0.208326 0.216549 0.205240 0.184804 0.258424 0.256448 0.211580 0.230697 0.216442 0.217223 0.218472 0.224915 0.335136 0.313420
chargesum: 0.00000
title: Mulliken charges with hydrogens summed into heavy atoms:
elementType: O N N N C C C C C C C C C C C C C
charge: -0.263287 -0.079384 -0.174969 0.029076 0.029000 0.040609 0.015312 0.037155 0.107757 0.469743 -0.060571 -0.146480 -0.164541 0.230761 -0.018054 -0.008015 -0.044113
polarizability: 2.45158605e+02 1.36383168e-01 1.59366301e+02 -1.13612237e-01 3.03262437e+00 9.47080301e+01
1716.lowfreq: -17.0710 -0.0007 -0.0006 0.0003 1.1826 7.6676 21.5549 26.6523 43.7765
frequency: 21.4292 26.5463 43.7569 51.0123 64.2505 91.3800 138.3817 172.9828 181.6584 227.4561 255.2046 289.0947 297.8523 351.3721 391.4448 408.0020 423.5750 448.9079 478.7678 497.5711 513.0496 517.6789 532.4449 592.0916 614.2473 627.2602 665.7403 690.3840 718.7824 756.4933 772.5335 791.4950 814.9014 843.0314 870.2309 873.4265 918.6508 953.7811 955.7707 975.7175 977.5433 1002.0257 1028.8142 1032.1915 1052.1054 1056.5081 1063.7001 1082.0186 1089.3947 1095.7919 1138.6308 1149.2130 1170.1068 1173.4341 1200.0144 1201.8027 1215.6399 1238.4088 1254.3284 1270.3129 1290.2117 1303.6802 1325.3461 1340.6204 1343.7064 1354.1067 1358.9885 1373.1418 1376.8081 1385.0469 1398.5974 1443.0815 1446.1433 1455.5502 1457.8449 1462.4851 1467.6309 1480.6548 1495.9556 1578.6965 1595.6621 1618.5227 1643.9513 2847.7319 2855.1078 2869.6775 2905.8853 2923.0515 2985.2730 3035.9794 3038.1550 3041.5100 3052.9739 3057.9913 3090.7433 3120.6832 3127.2762 3150.5725 3157.8514 3168.9732 3516.1005 3673.3303
redmass: 4.9740 5.1512 4.1850 3.0210 3.4689 3.1480 3.9375 7.5587 2.7268 2.4860 2.3151 3.9069 2.3005 4.5234 1.9778 2.8933 3.4063 2.8253 2.2811 1.4178 3.8143 2.7712 1.7969 2.6652 6.2214 2.0845 1.9019 1.8056 3.9372 1.8856 3.2519 1.4068 1.2961 1.5804 2.7559 1.5618 3.8209 2.1830 1.3790 1.3081 5.2130 2.5913 1.7860 2.1171 1.8098 2.5548 2.0649 2.4392 1.6794 2.1308 2.4284 2.9056 1.2800 1.4693 1.1403 1.1639 1.6701 1.4613 1.4414 1.4783 1.2744 1.4022 1.3913 1.6033 1.3751 1.7141 1.7387 1.8467 1.6027 3.3032 1.5003 1.0966 2.4044 1.0842 1.1125 1.1006 1.1036 1.0971 2.3952 5.9133 1.4283 6.0600 3.5731 1.0713 1.0707 1.0699 1.0689 1.0709 1.0587 1.0912 1.0906 1.0907 1.0902 1.0951 1.0894 1.0843 1.0885 1.0918 1.0939 1.0996 1.0447 1.1043
irintensity: 0.1322 11.0997 3.0424 2.1502 0.0915 1.0086 4.3540 3.4384 6.2621 8.0662 2.8816 1.1402 13.8456 0.9651 2.1891 0.8294 1.0808 4.3110 10.1156 57.7653 9.5128 44.9642 108.5758 41.0200 0.7298 19.5716 46.3044 41.7730 5.1469 79.2278 2.9610 6.3640 0.7019 0.5267 2.4998 8.1560 32.8697 7.7439 0.0783 0.4192 8.6478 65.1920 7.5828 9.1496 0.8698 9.0243 1.3106 2.1299 5.1771 4.0694 68.7993 27.3665 4.4795 13.4621 1.1099 4.4422 1.4433 182.3160 5.8504 82.0772 4.6566 53.5801 3.7968 28.6835 1.4896 66.6170 5.2079 16.9554 107.6229 25.2490 11.6095 11.7130 2.4666 1.0404 6.1959 43.7087 20.5329 12.1977 132.0075 10.3837 72.2614 160.0926 282.2414 49.3710 27.9186 163.5346 68.3832 96.8657 14.8824 32.1267 34.0851 24.2464 21.4859 37.4031 20.2679 9.1462 10.5897 40.1304 41.3446 5.7252 30.4145 21.5592
temp: 298.150 k
press: 1.00000 atm
elementType: 8 7 7 7 6 6 6 6 6 6 6 6 6 6 6 6 6 1 1 1 1 1 1 1 1 1 1 1 1 1 1 1 1 1 1 1
symmnumber: 1
zpe: 801292.5 jmol-1
zpe.correction: 0.305196 hartree
zpe.thermalcorrener: 0.321533 hartree
zpe.thermalcorrenthalpy: 0.322477 hartree
zpe.thermalcorrgfe: 0.258965 hartree
zpe.sumelectzpe: -744.963858 hartree
zpe.sumelectthermal: -744.947522 hartree
zpe.sumelectthermalent: -744.946578 hartree
zpe.sumelectthermalfe: -745.010090 hartree
dipole: -1.6517 -3.5942 0.5931
dipole: 3.9998
quadrupole: -102.6864 -92.6156 -107.6726
quadrupole: 23.8963 -3.9708 0.6695
quadrupole: -1.6948 8.3759 -6.6811 23.8963 -3.9708 0.6695
hfenergy: -745.2690545 hartree
pointgroup: C01 [X(C13H19N3O1)]
dipole: -0.646773 1.399522 -0.3151882 debye
polarizability: 245.1093652|-0.6908504|159.4881131|-2.5825433|-1.2658172|94.6354579 unknown
InChI: InChI=1S/C13H19N3O/c14-13(17)6-7-15-8-10-16(11-9-15)12-4-2-1-3-5-12/h1-5H,6-11,14H2
charge 0 multiplicity 1
36 atoms
O  -5.7478 -1.04644 0.411877
N  -1.557043 -0.288206 0.222397
N  1.332715 -0.113673 -0.023766
N  -6.292089 1.167115 -0.000473
C  -0.916036 0.822414 -0.5204
C  -0.727466 -1.510909 0.083873
C  0.502591 1.104901 0.008994
C  0.681529 -1.265305 0.644956
C  -2.964747 -0.527001 -0.177102
C  2.746371 0.004988 -0.008332
C  -3.907804 0.593551 0.304004
C  3.39277 1.275395 0.096674
C  3.580453 -1.148959 -0.139994
C  -5.377423 0.151972 0.23754
C  4.799682 1.380077 0.054553
C  4.983236 -1.031787 -0.170517
C  5.612357 0.232771 -0.07719
H  -1.519095 1.740559 -0.401079
H  -0.853097 0.590778 -1.615444
H  -0.64433 -1.832372 -0.98575
H  -1.205489 -2.329047 0.653218
H  0.960227 1.871504 -0.639914
H  0.430469 1.519229 1.041958
H  0.600047 -1.075592 1.739716
H  1.28573 -2.174267 0.504189
H  -3.070296 -0.658952 -1.284136
H  -3.308624 -1.466302 0.291328
H  -3.660269 0.808554 1.362496
H  -3.762759 1.530929 -0.265498
H  2.805595 2.187646 0.235529
H  3.134535 -2.142471 -0.249708
H  5.261371 2.37101 0.140631
H  5.590193 -1.93832 -0.280246
H  6.703536 0.31839 -0.104131
H  -7.285369 0.934836 -0.008422
H  -6.004972 2.132387 -0.150827
