program: Gaussian 09
title: 000258421
version: EM64L-G09RevD.01
frameworkgroup: C1[X(C21H20N2O4)]
method: RPBEPBE
basis: SDD
operation: Freq
keyword: #p
keyword: freq=noraman
keyword: PBEPBE/SDD
title: #p freq=noraman PBEPBE/SDD
converged: YES YES NO NO
title: Mulliken charges:
elementType: O O O O N N C C C C C C C C C C C C C C C C C C C C C H H H H H H H H H H H H H H H H H H H H
charge: -0.299227 -0.307413 -0.440056 -0.312268 -0.499919 -0.680512 0.398597 0.279120 0.396473 0.110201 -0.517075 -0.436198 -0.378709 0.323276 -0.515940 -0.414999 0.179154 0.311535 -0.406592 0.050470 -0.376437 -0.300352 -0.222915 -0.261515 0.134781 -0.522039 -0.531055 0.254397 0.230504 0.263296 0.396451 0.242868 0.233621 0.219107 0.270529 0.274043 0.226980 0.232710 0.335832 0.302223 0.219890 0.237972 0.229409 0.223648 0.222354 0.239768 0.384012
chargesum: 0.00000
title: Mulliken charges with hydrogens summed into heavy atoms:
elementType: O O O O N N C C C C C C C C C C C C C C C C C C C C C
charge: -0.299227 -0.307413 -0.056045 -0.312268 -0.103469 -0.042457 0.398597 0.279120 0.396473 0.110201 -0.262677 -0.205694 -0.115412 0.323276 -0.273073 -0.181378 0.179154 0.311535 -0.187485 0.050470 -0.105908 -0.026309 0.004066 -0.028805 0.134781 0.165232 0.154715
polarizability: 5.64115815e+02 -2.35956182e+01 2.84752416e+02 1.26942017e+00 1.07620696e+01 1.31093944e+02
1716.lowfreq: -6.2164 -3.4096 -0.0009 -0.0002 0.0006 2.5137 19.7941 22.3655 34.0556
frequency: 19.6572 22.3508 34.0434 40.4912 55.5736 74.5986 90.4185 92.1245 98.2394 129.8978 141.9208 153.3872 159.0522 164.2671 183.9910 199.7987 216.6752 239.4170 257.9803 275.5567 282.0921 295.9046 316.1335 339.7134 362.1346 384.2831 393.5251 400.0388 425.8315 444.4979 466.3359 482.3322 484.6712 506.0932 513.6492 517.8379 524.7029 535.4014 571.6842 582.1776 595.2272 603.7090 637.9787 656.4382 670.4781 682.2892 727.3591 733.8545 740.8987 750.4683 764.7120 772.6124 795.3377 809.6047 819.0198 826.3612 845.0058 854.0333 871.9210 877.7537 892.5787 903.0124 926.6745 949.0744 966.0619 973.2567 990.0900 1003.6290 1004.7635 1023.4941 1041.8549 1046.1159 1105.5043 1111.2257 1113.5526 1115.3680 1150.8273 1152.8630 1155.5588 1164.1966 1171.1367 1178.2049 1192.6252 1229.6797 1234.9007 1282.5717 1296.2078 1306.8115 1318.9398 1327.6223 1344.1145 1347.6785 1381.5002 1393.1894 1417.2142 1430.2392 1434.6828 1443.2200 1451.9507 1455.6378 1459.6869 1463.5203 1470.6466 1474.9107 1490.6249 1516.1730 1540.1837 1556.4268 1582.1701 1583.4542 1604.6324 1605.4755 1614.6734 1635.0376 1638.1153 2958.3405 2962.3595 3044.8528 3052.3853 3120.1856 3120.6136 3122.8621 3131.4255 3133.8912 3147.9210 3152.9231 3155.1011 3156.7919 3162.3378 3176.1511 3182.3318 3264.7555 3533.5717 3564.4584 3712.8226
redmass: 5.2938 5.5633 5.0008 4.5388 4.0191 4.0353 4.5085 4.8483 5.0355 3.7601 5.7503 1.3250 3.2401 4.2295 2.7495 2.3809 4.2382 2.5765 4.5134 4.8294 2.9436 4.4973 4.3372 1.9502 1.8756 5.4645 8.8271 4.7582 3.3416 2.9240 4.2437 3.6546 1.1144 5.9686 6.2566 3.7873 3.8389 4.3538 1.1981 7.0220 4.6671 4.7211 5.9103 3.8978 5.5833 4.4871 3.9449 3.3941 4.4951 2.7850 5.1548 1.7106 4.1511 1.6619 3.4613 1.4265 1.5489 1.5660 1.4444 4.4066 1.9080 2.6566 1.3767 1.3386 6.3368 1.3567 1.3208 5.2777 5.0933 1.6444 2.0808 2.1293 2.5587 1.4160 1.7373 1.2613 1.4048 1.4087 1.5763 1.5901 1.5493 1.1372 2.1357 1.8942 1.5320 1.7706 1.6607 1.7096 2.0228 3.4117 3.6158 2.9105 5.2675 7.5499 2.2509 2.3527 1.3334 2.5935 1.9218 2.3394 1.1227 1.0502 1.0622 1.0717 2.8998 3.4315 3.7398 6.3737 5.8671 6.6694 2.9779 1.6348 4.3938 4.2777 3.8289 1.0328 1.0312 1.1039 1.1044 1.0995 1.1010 1.0875 1.0872 1.0877 1.0941 1.0906 1.0918 1.0904 1.0953 1.0934 1.0983 1.0786 1.0641 1.0442 1.1046
irintensity: 0.2643 0.2392 0.5046 0.1835 1.1801 4.7697 1.5016 1.3002 5.2662 2.1393 0.8390 1.6269 2.2489 2.5503 1.2677 2.4636 11.0961 2.7113 1.2979 5.2733 2.4493 2.8982 11.6464 91.8292 128.7518 11.8116 6.0352 1.6073 14.8220 3.6261 5.7885 21.9406 88.4151 0.2669 3.0356 12.7719 6.2478 1.2035 113.8443 8.2154 28.3820 31.7123 1.0610 3.2707 7.0559 36.8880 3.6775 0.4166 11.4050 37.5912 24.9271 61.0068 9.9637 28.5667 38.5866 9.2661 115.3357 19.0278 2.3454 10.4200 13.0390 3.9014 0.7517 0.8025 55.2189 0.7380 2.6432 187.0815 208.4834 1.0633 31.7802 5.5620 52.7091 72.5951 146.2319 0.4356 29.5594 47.4991 27.5281 178.5900 45.9745 4.7363 140.4162 37.7038 16.6223 9.7681 19.4389 6.6100 34.1047 377.7204 8.3794 87.1577 14.9457 1.3167 5.2330 37.1229 70.7595 7.0983 163.7545 31.3837 43.8597 13.8439 2.6080 60.6476 113.9229 750.9722 46.7329 5.5889 272.0720 28.7456 303.5683 0.1607 88.8724 312.8371 251.5509 51.5422 61.3592 47.7303 40.6379 35.4369 20.3134 29.7326 8.1750 22.6372 14.8285 4.5628 18.2201 10.0351 4.0058 5.8340 13.6464 166.5208 76.7667 182.2192 34.2432
temp: 298.150 k
press: 1.00000 atm
elementType: 8 8 8 8 7 7 6 6 6 6 6 6 6 6 6 6 6 6 6 6 6 6 6 6 6 6 6 1 1 1 1 1 1 1 1 1 1 1 1 1 1 1 1 1 1 1 1
symmnumber: 1
zpe: 963192.4 jmol-1
zpe.correction: 0.366861 hartree
zpe.thermalcorrener: 0.391900 hartree
zpe.thermalcorrenthalpy: 0.392844 hartree
zpe.thermalcorrgfe: 0.310551 hartree
zpe.sumelectzpe: -1220.721570 hartree
zpe.sumelectthermal: -1220.696530 hartree
zpe.sumelectthermalent: -1220.695586 hartree
zpe.sumelectthermalfe: -1220.777879 hartree
dipole: 2.5215 2.6804 1.7908
dipole: 4.0926
quadrupole: -121.1373 -139.5572 -159.8165
quadrupole: 2.0064 -2.0340 -0.6363
quadrupole: 19.0330 0.6132 -19.6462 2.0064 -2.0340 -0.6363
hfenergy: -1221.0884303 hartree
pointgroup: C01 [X(C21H20N2O4)]
dipole: -0.9872165 1.0877609 -0.6594173 debye
polarizability: 564.7495269|18.0593415|284.3403505|-8.5304791|-7.9920972|130.8722972 unknown
InChI: InChI=1S/C21H20N2O4/c1-26-19-11-13(7-9-16(19)22)14-8-10-18(20(12-14)27-2)23-17-6-4-3-5-15(17)21(24)25/h3-12,23-24H,22H2,1-2H3
charge 0 multiplicity 1
47 atoms
O  1.073525 -2.664836 -0.754934
O  -6.290259 1.816412 0.086281
O  6.664146 -1.140809 0.851589
O  4.570459 -2.089245 0.597642
N  2.515582 -0.445894 0.050643
N  -7.531667 -0.510181 0.470998
C  -1.782891 -0.427206 0.20015
C  1.102894 -0.351908 0.06722
C  -3.266453 -0.466489 0.270021
C  0.36496 -1.505949 -0.339825
C  -1.035886 -1.542457 -0.272913
C  -1.043385 0.71593 0.61756
C  0.362986 0.754431 0.562583
C  3.45678 0.567604 -0.093075
C  -4.036019 0.729313 0.14346
C  -3.968047 -1.684503 0.465377
C  -5.436873 0.695535 0.211817
C  -6.143384 -0.535166 0.410911
C  -5.375349 -1.720529 0.535867
C  4.858416 0.297967 0.160768
C  3.104156 1.884424 -0.531158
C  5.81827 1.341469 0.021998
C  4.075825 2.885433 -0.671396
C  5.443378 2.630831 -0.379276
C  5.298867 -1.048428 0.540338
C  1.526342 -2.629576 -2.162227
C  -5.663832 3.120817 -0.114765
H  -1.538974 -2.450662 -0.619994
H  -1.573433 1.572301 1.049039
H  0.889603 1.623875 0.966164
H  2.910763 -1.394573 0.197384
H  -3.521752 1.676372 -0.046927
H  -3.408873 -2.616176 0.602669
H  -5.889379 -2.674771 0.70225
H  2.06755 2.099744 -0.799226
H  6.864406 1.102538 0.231835
H  3.769157 3.877377 -1.023211
H  6.191828 3.422186 -0.482123
H  -8.010941 0.380717 0.373256
H  -8.066361 -1.362695 0.600923
H  0.655821 -2.609974 -2.845982
H  2.103828 -3.554377 -2.311091
H  2.169394 -1.749308 -2.354086
H  -5.083659 3.146039 -1.057944
H  -5.001285 3.381734 0.73366
H  -6.494384 3.840196 -0.171736
H  6.861247 -2.087034 1.085587
