program: Gaussian 09
title: 000258316
version: EM64L-G09RevD.01
frameworkgroup: C1[X(C14H19N3)]
method: RPBEPBE
basis: SDD
operation: Freq
keyword: #pfreq=noraman
keyword: PBEPBE/SDD
title: #p freq=noraman PBEPBE/SDD
converged: YES YES NO NO
title: Mulliken charges:
elementType: N N N C C C C C C C C C C C C C C H H H H H H H H H H H H H H H H H H H
charge: -0.080452 -0.189920 -0.017800 -0.369531 -0.380905 -0.410003 -0.388845 -0.325227 0.284069 0.302655 -0.436089 -0.345027 -0.372988 -0.830414 -0.253957 -0.252354 -0.153965 0.196982 0.198420 0.192304 0.212688 0.230302 0.194124 0.215719 0.223888 0.204353 0.227584 0.265703 0.249910 0.240270 0.226922 0.228435 0.221291 0.244204 0.222300 0.225356
chargesum: 0.00000
title: Mulliken charges with hydrogens summed into heavy atoms:
elementType: N N N C C C C C C C C C C C C C C
charge: -0.080452 -0.189920 -0.017800 0.025871 0.024087 0.014423 0.050762 0.106710 0.284069 0.302655 0.079523 -0.104757 -0.146065 -0.136484 -0.031657 -0.026998 -0.153965
polarizability: 2.49178519e+02 7.76355875e+00 1.57306675e+02 -1.98131166e+00 -4.56599648e+00 1.04337373e+02
1716.lowfreq: -9.3139 -1.8577 0.0007 0.0008 0.0010 10.3972 27.1370 37.8833 59.6098
frequency: 26.9935 37.8120 59.5877 72.2921 83.7713 118.1302 154.7848 185.6025 197.4848 201.1813 254.4164 275.8547 290.8212 312.0245 326.9468 364.4056 377.7995 402.1802 448.9443 456.0267 465.7198 491.0774 532.7278 551.7320 575.4538 629.7330 702.8809 724.3720 761.3046 766.5780 774.8778 794.3420 844.4205 857.4237 920.4738 928.9001 936.6111 952.0582 975.3838 981.9900 1002.7789 1033.6687 1038.6368 1043.4518 1048.6795 1055.1516 1059.0394 1094.2880 1116.7790 1133.9974 1145.7882 1165.9046 1174.3574 1196.0373 1202.2800 1217.5329 1231.2135 1255.7670 1276.7873 1289.2634 1290.7431 1301.6623 1333.9444 1341.3779 1344.8057 1362.0086 1367.2382 1378.5432 1389.0115 1391.5955 1432.8173 1445.8011 1454.3763 1456.0999 1458.0077 1463.1553 1467.7668 1480.7562 1487.3439 1492.3752 1581.9176 1609.4980 2198.5698 2864.6914 2870.2903 2888.7008 2893.6137 2911.0534 2963.0689 3006.8951 3030.4312 3034.2866 3041.7035 3042.6921 3055.2340 3070.2340 3080.9492 3092.3089 3114.8404 3126.7980 3146.3853 3161.7453
redmass: 5.8364 4.3118 2.8932 3.8669 3.6108 3.9364 5.5314 2.9212 1.1508 2.6619 2.6962 2.3543 3.0652 3.1374 2.6351 3.0180 3.1468 2.5984 2.9917 3.6798 3.0845 3.4514 5.5760 3.3880 4.9174 2.7195 3.3744 2.3935 1.5290 2.5693 1.4349 4.3107 1.5231 1.3590 3.4415 2.1269 1.9485 2.5074 1.3171 1.5536 2.6749 3.2479 1.7309 1.5480 2.2681 2.0926 1.8790 2.2590 1.8323 2.5357 2.9300 1.9900 1.0907 1.1084 2.2383 1.6800 1.6603 1.2844 1.3058 1.3348 1.5096 1.3627 1.2772 1.5036 1.6096 1.7740 1.6870 2.3390 1.3928 1.2703 2.0146 1.0845 1.0836 1.1112 1.1479 1.1086 1.0655 1.0938 1.1919 2.1252 6.4304 6.0377 12.4229 1.0702 1.0698 1.0703 1.0688 1.0713 1.0400 1.0590 1.0889 1.0914 1.0897 1.0926 1.0905 1.1009 1.0994 1.0888 1.0869 1.0878 1.0928 1.1003
irintensity: 1.1049 7.4605 0.2625 2.1128 1.3860 1.2217 4.2129 0.4060 2.0879 4.3747 4.9321 2.5499 0.4232 2.3842 9.5334 0.4376 1.2479 0.9679 5.5493 6.8658 3.6915 6.1872 0.3712 3.0768 0.9045 1.5857 4.0718 15.6329 61.8913 15.2858 2.4736 2.2588 0.1210 1.0580 22.9274 2.7120 0.7338 7.9089 0.4835 5.3235 56.1888 16.5149 0.7515 7.9069 10.7854 8.2574 1.6432 6.8421 21.1918 63.9259 41.3908 10.0540 0.4864 6.6561 5.3956 25.4904 68.9433 22.2323 1.7769 6.6334 4.4338 28.3627 17.6712 4.5646 22.7336 4.0143 43.3168 12.0907 3.5733 13.9774 20.5507 8.3796 3.9249 12.9989 26.2942 3.0673 20.2877 12.8152 6.1519 98.2284 7.7625 41.8919 19.9053 60.9531 30.3410 64.2551 109.6675 117.3344 37.5679 5.2129 45.9522 44.6283 19.8397 24.6683 25.0975 18.3027 20.9063 12.7445 11.9817 10.7386 35.2866 24.8828
temp: 298.150 k
press: 1.00000 atm
elementType: 7 7 7 6 6 6 6 6 6 6 6 6 6 6 6 6 6 1 1 1 1 1 1 1 1 1 1 1 1 1 1 1 1 1 1 1
symmnumber: 1
zpe: 798638.1 jmol-1
zpe.correction: 0.304185 hartree
zpe.thermalcorrener: 0.320596 hartree
zpe.thermalcorrenthalpy: 0.321540 hartree
zpe.thermalcorrgfe: 0.259277 hartree
zpe.sumelectzpe: -707.829973 hartree
zpe.sumelectthermal: -707.813562 hartree
zpe.sumelectthermalent: -707.812618 hartree
zpe.sumelectthermalfe: -707.874881 hartree
dipole: -3.2963 -0.1227 0.4479
dipole: 3.3288
quadrupole: -146.1794 -93.5671 -104.3847
quadrupole: -4.2163 2.9562 1.0652
quadrupole: -31.4690 21.1433 10.3257 -4.2163 2.9562 1.0652
hfenergy: -708.1341582 hartree
pointgroup: C01 [X(C14H19N3)]
dipole: 1.3018774 0.0578759 0.1302049 debye
polarizability: 249.4496464|5.4176987|155.8085616|-3.3846313|-9.0780779|105.5643595 unknown
InChI: InChI=1S/C14H19N3/c1-13-5-2-3-6-14(13)17-11-9-16(10-12-17)8-4-7-15/h2-3,5-6H,4,8-12H2,1H3
charge 0 multiplicity 1
36 atoms
N  -2.074006 -0.014433 0.315465
N  0.795447 -0.012187 -0.071845
N  -6.985685 0.100959 -0.092141
C  -1.458229 0.514971 -0.92798
C  -1.222674 -1.084524 0.89701
C  -0.044651 1.057739 -0.648696
C  0.189177 -0.543687 1.175785
C  -3.48107 -0.429898 0.143591
C  2.220155 0.151036 -0.105142
C  3.07421 -1.001061 -0.051584
C  -4.426252 0.807047 0.138209
C  2.805278 1.441561 -0.246574
C  4.47566 -0.804595 -0.098276
C  2.514849 -2.41282 -0.022042
C  4.204794 1.606968 -0.307983
C  5.051318 0.480553 -0.219497
C  -5.842193 0.427231 0.009214
H  -2.080482 1.337712 -1.325628
H  -1.39141 -0.277962 -1.714644
H  -1.140788 -1.965857 0.212236
H  -1.678979 -1.423834 1.845502
H  0.407831 1.398891 -1.596396
H  -0.132788 1.935351 0.03592
H  0.121106 0.260529 1.945404
H  0.820732 -1.347409 1.583742
H  -3.645425 -1.02408 -0.788231
H  -3.760456 -1.07717 0.994418
H  -4.276047 1.370219 1.077351
H  -4.167434 1.488174 -0.693671
H  2.161828 2.326343 -0.290891
H  5.127642 -1.686831 -0.067357
H  3.21439 -3.115616 -0.507431
H  2.34869 -2.785255 1.008575
H  1.54578 -2.455915 -0.551196
H  4.629141 2.612029 -0.41362
H  6.139738 0.596222 -0.26119
