program: Gaussian 09
title: 000258311
version: EM64L-G09RevD.01
frameworkgroup: C1[X(C13H18N2O2)]
method: RPBEPBE
basis: SDD
operation: Freq
keyword: #p
keyword: freq=noraman
keyword: PBEPBE/SDD
title: #p freq=noraman PBEPBE/SDD
converged: YES YES NO NO
title: Mulliken charges:
elementType: O O N N C C C C C C C C C C C C C H H H H H H H H H H H H H H H H H H
charge: -0.311882 -0.304017 -0.176659 -0.145896 -0.380377 -0.405880 -0.405673 -0.363150 0.431287 0.308467 -0.363893 -0.367625 -0.399252 -0.405389 0.449065 -0.812660 -0.489333 0.228979 0.218501 0.230905 0.215659 0.264842 0.227404 0.245849 0.230875 0.232287 0.225923 0.223011 0.222501 0.220182 0.220784 0.230255 0.238512 0.240129 0.226267
chargesum: 0.00000
title: Mulliken charges with hydrogens summed into heavy atoms:
elementType: O O N N C C C C C C C C C C C C C
charge: -0.311882 -0.304017 -0.176659 -0.145896 0.067103 0.040684 0.086573 0.113575 0.431287 0.308467 -0.131606 -0.141702 -0.176241 -0.182888 0.449065 -0.141439 0.215575
polarizability: 2.55358495e+02 2.53307609e+00 1.44379683e+02 2.88707647e+00 -8.16645633e+00 1.00206508e+02
1716.lowfreq: -27.5207 -7.8303 -0.0009 -0.0005 0.0004 3.1945 12.7613 17.5713 41.5808
frequency: -27.4411 15.5877 41.4885 66.4624 75.5843 97.1318 118.0232 120.3891 146.8461 174.9746 191.9279 215.8157 266.1916 288.4349 304.4059 324.0361 339.7654 400.6684 414.4728 442.7173 487.5054 505.7036 517.0994 554.1349 623.7144 637.4200 675.1513 695.5465 711.5351 744.0504 788.9947 803.0153 811.7786 862.7574 889.7139 923.7176 934.3220 950.5902 973.1880 986.1096 998.6909 1004.4050 1045.0158 1047.5379 1075.9539 1080.4547 1084.8170 1118.5225 1134.5672 1146.2911 1184.4518 1202.6597 1202.9088 1207.8625 1230.9578 1242.8381 1255.9930 1284.6386 1321.8543 1338.8044 1348.1822 1357.6405 1359.3184 1379.0333 1380.8435 1383.0429 1397.3338 1426.3221 1435.7998 1449.8438 1470.0052 1472.6577 1474.9438 1479.0358 1480.2411 1488.8806 1494.4278 1523.6296 1570.0801 1635.6321 1647.7947 2919.8396 2929.2164 2966.7624 2977.2343 2980.6702 3001.1702 3013.5261 3034.9783 3045.7756 3069.6686 3076.3029 3078.5823 3101.8427 3112.9314 3115.3147 3140.1722 3151.0343 3155.9612
redmass: 1.0209 4.3111 4.0162 2.1476 1.4567 4.0999 3.6490 3.4382 3.5087 3.4315 3.6820 6.5232 1.8741 3.4731 2.8813 3.1644 3.4393 4.3542 3.0133 3.5711 3.2236 4.1566 2.8298 3.7708 2.6556 6.8254 3.0225 11.3577 2.8677 4.9411 4.1050 1.6777 1.3637 1.5267 4.5114 1.3388 3.5643 1.3580 2.1506 1.4003 2.7743 2.7798 1.5173 2.6808 2.1761 2.4896 2.1971 1.2545 1.3657 1.4347 2.8347 1.3147 1.2944 1.2452 2.6327 1.5124 1.8771 1.6756 1.3566 1.5446 1.5677 1.7372 1.7074 1.9693 2.3478 2.1991 1.2303 3.3011 1.3150 1.0507 1.0588 1.0523 1.0996 1.0988 1.0823 1.0992 1.0930 2.7504 5.8325 6.3878 9.7657 1.0699 1.0687 1.0389 1.0675 1.0675 1.0295 1.0943 1.0912 1.0946 1.0962 1.0994 1.0952 1.1046 1.0887 1.0885 1.1045 1.0930 1.0940
irintensity: 0.5302 0.4597 0.7923 1.2494 2.7579 0.5761 3.1343 6.2028 8.0534 3.3864 0.2180 0.6279 0.4182 17.8584 4.9777 6.7477 6.9926 2.1467 0.4320 2.8780 0.7755 14.1202 9.9860 2.5055 0.2811 0.0637 0.2506 19.6075 0.9147 13.3480 2.8157 70.2762 3.2359 3.8802 2.8782 2.8805 49.9640 0.4051 14.4704 1.6969 2.0855 2.6469 16.3718 93.5636 12.3335 62.5604 54.3597 0.1100 7.4813 62.7460 34.0968 4.3672 3.9172 210.4492 6.7418 19.2558 20.6221 66.4118 1.6993 19.9713 130.9442 14.2110 30.6606 139.6106 37.3360 37.1184 10.5687 4.3033 124.9663 12.3908 12.1520 12.0670 9.9208 91.5463 4.8449 19.1440 15.9825 223.5460 7.7476 176.3229 388.4266 91.9564 44.0810 66.0188 49.5495 20.8661 53.7615 41.7204 27.6255 28.0071 19.0887 20.4275 7.6059 30.5004 16.7770 36.8488 18.3583 32.1025 8.2696
temp: 298.150 k
press: 1.00000 atm
elementType: 8 8 7 7 6 6 6 6 6 6 6 6 6 6 6 6 6 1 1 1 1 1 1 1 1 1 1 1 1 1 1 1 1 1 1
symmnumber: 1
zpe: 764747.9 jmol-1
zpe.correction: 0.291277 hartree
zpe.thermalcorrener: 0.307610 hartree
zpe.thermalcorrenthalpy: 0.308554 hartree
zpe.thermalcorrgfe: 0.245800 hartree
zpe.sumelectzpe: -764.847426 hartree
zpe.sumelectthermal: -764.831093 hartree
zpe.sumelectthermalent: -764.830149 hartree
zpe.sumelectthermalfe: -764.892904 hartree
dipole: -0.1576 -1.7378 -0.4767
dipole: 1.8089
quadrupole: -101.7324 -97.4866 -102.9940
quadrupole: -10.4993 -3.9044 -3.6555
quadrupole: -0.9947 3.2511 -2.2563 -10.4993 -3.9044 -3.6555
hfenergy: -765.1387032 hartree
pointgroup: C01 [X(C13H18N2O2)]
dipole: -0.0662453 -0.6953701 -0.1362216 debye
polarizability: 255.4128758|2.1386701|142.9200662|1.4456446|-11.3474004|101.6117444 unknown
InChI: InChI=1S/C13H18N2O2/c1-11-3-5-12(6-4-11)14-7-9-15(10-8-14)13(16)17-2/h3-6H,7-10H2,1-2H3
charge 0 multiplicity 1
35 atoms
O  4.48517 -0.906625 -0.469742
O  4.559362 1.331748 0.264078
N  -0.356179 0.047535 0.118933
N  2.54143 0.130397 0.170143
C  0.378258 1.308907 -0.102567
C  0.433619 -1.141026 0.483488
C  1.734913 1.282549 0.623227
C  1.82422 -1.116829 -0.179745
C  -1.759834 0.005241 0.046068
C  3.900868 0.284503 0.015594
C  -2.499936 1.077566 -0.541158
C  -2.503228 -1.102336 0.558416
C  -3.906716 1.032864 -0.608042
C  -3.909804 -1.129556 0.471902
C  -4.647876 -0.069612 -0.112485
C  -6.162428 -0.123276 -0.223367
C  5.950798 -0.835846 -0.642577
H  -0.210214 2.153377 0.305382
H  0.538537 1.508469 -1.185063
H  -0.086384 -2.046808 0.121982
H  0.545562 -1.243602 1.586245
H  2.304038 2.203741 0.414659
H  1.570746 1.23125 1.71845
H  2.414364 -1.985544 0.157405
H  1.713291 -1.198216 -1.279557
H  -1.97849 1.940065 -0.967994
H  -1.991025 -1.931201 1.057407
H  -4.439981 1.874942 -1.067797
H  -4.446877 -1.993788 0.883553
H  -6.604815 -0.737768 0.58131
H  -6.609532 0.885339 -0.162037
H  -6.484362 -0.5654 -1.187185
H  6.444959 -0.618728 0.319576
H  6.217107 -0.048814 -1.368114
H  6.235238 -1.829918 -1.017087
