program: Gaussian 09
title: 000258322
version: EM64L-G09RevD.01
frameworkgroup: C1[X(C18H16Cl2N2O2)]
method: RPBEPBE
basis: SDD
operation: Freq
keyword: #p
keyword: freq=noraman
keyword: PBEPBE/SDD
title: #p freq=noraman PBEPBE/SDD
converged: YES YES NO NO
title: Mulliken charges:
elementType: Cl Cl O O N N C C C C C C C C C C C C C C C C C C H H H H H H H H H H H H H H H H
charge: -0.044853 -0.044867 -0.267020 -0.266994 -0.137134 -0.137200 -0.389409 -0.393783 -0.389229 -0.393783 0.139402 0.139296 0.276151 0.276343 -0.326775 -0.326743 -0.364068 -0.363966 -0.223721 -0.223672 -0.204304 -0.204340 -0.101243 -0.101244 0.256236 0.220339 0.242274 0.267446 0.256157 0.220314 0.242300 0.267469 0.257155 0.257036 0.271915 0.271857 0.260445 0.260444 0.260889 0.260884
chargesum: 0.00000
title: Mulliken charges with hydrogens summed into heavy atoms:
elementType: Cl Cl O O N N C C C C C C C C C C C C C C C C C C
charge: -0.044853 -0.044867 -0.267020 -0.266994 -0.137134 -0.137200 0.087165 0.115936 0.087241 0.115985 0.139402 0.139296 0.276151 0.276343 -0.069619 -0.069707 -0.092153 -0.092109 0.036724 0.036771 0.056585 0.056544 -0.101243 -0.101244
polarizability: 3.06129962e+02 2.93042480e-02 2.43328240e+02 -3.13280258e+01 -4.71964967e-03 1.72238702e+02
1716.lowfreq: -0.0022 -0.0013 -0.0003 2.3413 4.7993 11.5755 20.5315 21.8926 32.7096
frequency: 20.5163 21.1489 32.6683 45.5824 55.0025 75.4088 76.4285 89.2436 106.4077 143.4262 145.4785 205.6023 217.0833 249.1269 258.0339 288.5024 295.8364 317.7822 330.7413 331.3398 346.0810 410.8444 410.8984 427.6224 432.4655 447.6031 450.2117 472.9950 478.0785 508.9248 548.8285 605.5453 619.7119 620.6057 633.7371 643.0901 683.9322 685.3670 722.2234 722.7683 740.3775 741.6224 830.3660 831.4285 838.6921 839.3387 845.9216 850.6484 897.4307 951.2531 961.2497 961.6485 973.9652 974.1004 992.2738 999.2751 1006.1066 1018.6042 1046.4958 1064.3473 1072.4322 1075.0052 1109.0757 1109.3823 1128.4129 1148.1247 1176.0249 1183.9822 1184.8295 1198.4534 1220.4062 1253.3749 1262.0900 1285.5592 1293.7805 1294.6235 1338.7085 1342.7385 1352.9229 1364.1036 1365.0226 1365.9194 1392.3543 1392.3803 1407.7744 1408.3916 1447.4500 1449.6877 1460.4416 1461.9915 1476.8214 1477.0236 1550.4490 1551.5721 1582.7598 1582.8244 1595.8807 1596.1093 2974.6619 2986.2294 2993.7134 3004.7746 3098.3768 3099.0682 3099.8191 3100.4392 3140.8744 3140.9054 3155.6617 3155.6759 3170.7462 3170.7674 3176.8483 3176.8621
redmass: 14.8955 4.4758 7.0305 9.7947 4.9666 6.1342 6.6537 3.7817 7.2587 5.8826 7.1809 6.6724 6.0827 7.4208 10.0570 4.4845 5.3705 4.9444 2.3603 3.3483 4.9678 2.9316 2.9458 2.3988 4.8600 3.5097 4.3972 6.8795 4.2551 4.1876 4.1193 2.6652 6.2556 7.0119 6.0663 3.5228 5.6818 4.9140 6.7554 6.2955 3.6584 3.5998 1.4813 1.9396 1.5084 1.3534 1.5985 2.1064 4.0972 2.7756 1.3430 1.3528 1.3745 1.3786 3.1146 4.5638 3.2888 2.9075 1.7480 3.0773 2.9085 2.3223 1.3570 1.3638 2.2238 3.6314 2.3641 1.1177 1.1261 1.9984 1.6106 2.2053 1.7436 1.4872 1.2536 1.2692 1.2494 1.2299 1.4323 2.4751 5.0447 1.9907 3.7175 3.6867 2.4696 2.2976 1.1146 1.1169 1.1289 1.1197 2.4709 2.4943 8.7251 8.6481 7.8158 7.8173 6.2351 6.2571 1.0691 1.0664 1.0670 1.0638 1.0947 1.0934 1.0977 1.1013 1.0893 1.0893 1.0889 1.0889 1.0960 1.0960 1.0973 1.0973
irintensity: 0.0370 2.7063 0.1580 0.4869 0.0171 7.9829 0.0550 1.9383 0.2104 3.6024 0.4402 1.5217 1.1972 1.6504 0.7076 5.2236 0.0047 9.7786 1.8649 17.4338 0.0575 0.0634 0.0371 0.3427 2.6307 6.0432 31.1262 8.3897 8.9751 59.6176 0.0295 0.5392 1.4206 0.3847 3.4024 3.2935 2.7477 32.1994 12.5121 20.9474 5.4054 28.2639 28.0758 1.7379 0.5822 0.0786 65.9627 48.2669 9.3400 2.4681 2.1040 0.0563 1.5558 0.9707 265.2235 41.8586 6.5012 2.3845 10.5361 4.1367 41.9016 47.5868 23.9340 1.4526 79.4013 11.9589 0.4001 15.2425 0.4489 2.1814 26.6321 388.1312 22.3434 66.4030 1.6828 6.7903 0.4809 0.8913 1.0117 7.5905 0.5876 15.2145 0.9929 10.0013 419.4762 23.5916 67.2474 10.2282 6.0263 6.3798 34.6931 4.7404 282.3403 160.9390 50.4490 40.3228 74.6337 49.4263 15.2096 43.5549 13.1601 53.7725 9.5793 5.5652 10.9250 3.7928 13.0802 0.9831 0.4654 0.4609 3.4458 3.6542 1.9933 0.9459
temp: 298.150 k
press: 1.00000 atm
elementType: 17 17 8 8 7 7 6 6 6 6 6 6 6 6 6 6 6 6 6 6 6 6 6 6 1 1 1 1 1 1 1 1 1 1 1 1 1 1 1 1
symmnumber: 1
zpe: 796392.0 jmol-1
zpe.correction: 0.303330 hartree
zpe.thermalcorrener: 0.324554 hartree
zpe.thermalcorrenthalpy: 0.325498 hartree
zpe.thermalcorrgfe: 0.249745 hartree
zpe.sumelectzpe: -1873.892191 hartree
zpe.sumelectthermal: -1873.870966 hartree
zpe.sumelectthermalent: -1873.870022 hartree
zpe.sumelectthermalfe: -1873.945776 hartree
dipole: 0.0018 2.8563 0.0051
dipole: 2.8564
quadrupole: -186.8593 -175.3001 -140.4804
quadrupole: 0.0014 -1.5205 -0.0157
quadrupole: -19.3127 -7.7535 27.0662 0.0014 -1.5205 -0.0157
hfenergy: -1874.1955206 hartree
pointgroup: C01 [X(C18H16Cl2N2O2)]
dipole: 0.0010933 1.1237749 -0.0013971 debye
polarizability: 302.1134351|-0.1010961|243.3276397|-38.7695999|-0.1989754|176.2558289 unknown
InChI: InChI=1S/C18H16Cl2N2O2/c19-15-5-1-13(2-6-15)17(23)21-9-11-22(12-10-21)18(24)14-3-7-16(20)8-4-14/h1-8H,9-12H2
charge 0 multiplicity 1
40 atoms
Cl 6.542505 3.276809 -0.242295
Cl -6.542572 3.280482 0.215741
O  3.126933 -2.5926 -0.712579
O  -3.128864 -2.587196 0.718924
N  1.403074 -1.410379 0.321648
N  -1.403291 -1.410516 -0.31861
C  0.612559 -0.172902 0.478659
C  0.606184 -2.650741 0.480988
C  -0.611711 -0.174376 -0.480793
C  -0.607463 -2.652259 -0.472494
C  2.680621 -1.496915 -0.239898
C  -2.681262 -1.49367 0.242488
C  3.553781 -0.266472 -0.231076
C  -3.554281 -0.263191 0.226202
C  3.672053 0.577935 0.903341
C  -3.671748 0.574883 -0.912998
C  4.385299 -0.031216 -1.355628
C  -4.386634 -0.021664 1.348797
C  4.586321 1.653811 0.910612
C  -4.585858 1.650828 -0.92685
C  5.28932 1.051139 -1.372433
C  -5.290533 1.060875 1.358985
C  5.372135 1.881116 -0.236111
C  -5.372415 1.884597 0.218059
H  1.236025 0.705802 0.254818
H  0.250568 -0.093282 1.523618
H  0.253869 -2.715868 1.528394
H  1.265024 -3.505128 0.259148
H  -1.234374 0.705802 -0.260596
H  -0.249622 -0.099396 -1.526073
H  -0.255182 -2.722298 -1.519593
H  -1.267075 -3.505084 -0.246947
H  3.077255 0.378815 1.801616
H  -3.076505 0.37066 -1.809833
H  4.329686 -0.716885 -2.206944
H  -4.331699 -0.702604 2.203945
H  4.690578 2.294686 1.790672
H  -4.68948 2.286788 -1.81054
H  5.923136 1.239354 -2.243632
H  -5.924959 1.253957 2.228669
