program: Gaussian 09
title: 000258286
version: EM64L-G09RevD.01
frameworkgroup: C1[X(C13H13NO6)]
method: RPBEPBE
basis: SDD
operation: Freq
keyword: #p
keyword: freq=noraman
keyword: PBEPBE/SDD
title: #p freq=noraman PBEPBE/SDD
converged: NO YES NO NO
title: Mulliken charges:
elementType: O O O O O O N C C C C C C C C C C C C C H H H H H H H H H H H H H
charge: -0.408576 -0.264819 -0.421343 -0.248920 -0.334560 -0.251752 -0.476306 0.557915 0.107700 -0.598862 0.195665 -0.363002 -0.313118 0.237861 0.168657 -0.306142 -0.232133 -0.247877 -0.669938 0.245285 0.254980 0.314505 0.271571 0.319314 0.247623 0.232359 0.232822 0.288852 0.390536 0.213813 0.232832 0.232972 0.392084
chargesum: 0.00000
title: Mulliken charges with hydrogens summed into heavy atoms:
elementType: O O O O O O N C C C C C C C C C C C C C
charge: -0.018039 -0.264819 -0.029259 -0.248920 -0.334560 -0.251752 -0.156992 0.557915 0.107700 -0.343882 0.195665 -0.048497 -0.041547 0.237861 0.168657 -0.058518 0.233048 0.040975 0.009679 0.245285
polarizability: 3.96922386e+02 -6.38919456e+00 1.66798453e+02 -3.76137411e-01 2.06760477e-01 7.68507691e+01
1716.lowfreq: -20.6023 -6.1580 -0.0013 -0.0013 -0.0009 0.5338 9.5198 24.6763 35.3492
frequency: -14.1764 23.9956 35.3406 48.2503 63.6008 93.9908 105.1275 106.2971 120.3203 153.1767 190.1463 199.2627 204.4404 237.1467 243.2247 261.9457 295.8460 307.3279 308.3374 343.6694 369.6682 427.7982 452.2320 482.7131 515.5275 567.9473 571.8306 598.2027 610.7207 624.9027 660.0690 673.5561 687.8116 724.1344 729.8728 741.4294 753.1756 784.7067 795.2660 830.1693 852.4561 859.4359 876.9298 912.8931 922.6016 959.3572 988.8583 999.6998 1000.5859 1022.9141 1027.9394 1113.0754 1121.1119 1134.0222 1135.1131 1145.6493 1176.4453 1202.9932 1238.2020 1247.9458 1276.2689 1297.8644 1310.7164 1324.8623 1355.7213 1366.7058 1400.1488 1404.8744 1449.7610 1463.2423 1471.3784 1485.0691 1493.4816 1496.4595 1581.5317 1583.3226 1603.6880 1608.0452 1654.2732 1663.5087 2998.3374 3008.0199 3009.6198 3068.3997 3094.8184 3108.7460 3110.9718 3151.2015 3164.7004 3168.0820 3207.3516 3518.3000 3529.8462
redmass: 3.0090 5.8557 5.5322 5.6276 4.9535 3.8190 5.0028 5.7929 8.4757 6.6837 4.2952 6.4779 1.6507 5.8741 5.2727 1.7274 9.6695 6.8085 4.6383 4.8528 5.0384 8.2361 2.7969 5.3687 5.2342 6.6113 1.2722 6.0205 3.1563 2.8742 7.2309 1.8050 2.7185 5.0851 8.3590 6.4717 3.3672 5.1626 1.1040 4.0532 1.1999 1.3758 1.6579 2.1514 5.5893 4.1446 3.7608 1.3004 1.0980 2.6665 4.1349 2.3067 1.8461 1.5853 1.9994 2.1293 1.5623 1.6464 1.6873 1.1348 1.9499 1.9269 1.7472 2.1269 1.4360 4.1748 1.2631 6.2962 2.7956 1.0401 1.0639 1.0653 3.0587 2.3955 4.4079 6.4165 4.8001 7.1539 5.2930 5.9217 1.0360 1.0688 1.0580 1.1067 1.0985 1.0921 1.1024 1.0921 1.0923 1.0911 1.0956 1.0764 1.0641
irintensity: 0.0745 0.4274 0.1690 0.1013 4.3938 1.1513 2.2930 2.5007 5.4141 2.3207 1.5514 6.5379 3.4537 13.4659 1.1933 4.2589 0.0793 3.1470 1.0338 6.6468 18.4620 15.8428 24.5087 5.0041 26.0816 0.6252 115.8406 12.7760 0.7759 2.4509 43.7818 82.2375 14.3472 8.7347 19.0912 8.8762 0.0121 2.0092 3.6256 14.1376 182.1352 39.5863 37.9106 3.6787 18.0518 47.4433 11.5329 7.2751 59.6313 269.4273 174.4426 33.7967 182.4776 88.0005 320.8707 13.7166 85.3753 95.8150 59.7013 0.0215 494.3528 14.9704 239.7972 32.7316 0.8199 563.2169 18.9527 38.3284 220.3576 12.4700 4.6580 13.6546 275.8893 119.4473 5.3493 311.7010 140.0496 54.1118 250.7546 236.6562 24.6770 307.4799 14.1230 9.4283 28.9515 2.4809 40.3410 3.9301 1.7517 1.0111 8.1449 15.9103 91.7039
temp: 298.150 k
press: 1.00000 atm
elementType: 8 8 8 8 8 8 7 6 6 6 6 6 6 6 6 6 6 6 6 6 1 1 1 1 1 1 1 1 1 1 1 1 1
symmnumber: 1
zpe: 641860.7 jmol-1
zpe.correction: 0.244472 hartree
zpe.thermalcorrener: 0.262973 hartree
zpe.thermalcorrenthalpy: 0.263917 hartree
zpe.thermalcorrgfe: 0.196082 hartree
zpe.sumelectzpe: -1007.848476 hartree
zpe.sumelectthermal: -1007.829975 hartree
zpe.sumelectthermalent: -1007.829031 hartree
zpe.sumelectthermalfe: -1007.896866 hartree
dipole: 2.0984 -0.5713 0.0241
dipole: 2.1749
quadrupole: -87.2261 -121.8434 -117.5025
quadrupole: 10.2344 0.2791 0.0291
quadrupole: 21.6312 -12.9860 -8.6452 10.2344 0.2791 0.0291
hfenergy: -1008.0929481 hartree
pointgroup: C01 [X(C13H13N1O6)]
dipole: -0.8247629 -0.2273744 -0.0160446 debye
polarizability: 396.8725635|7.1424827|166.8380636|1.361357|0.7206514|76.8609804 unknown
InChI: InChI=1S/C13H13NO6/c1-2-20-12(17)6-5-11(16)14-8-3-4-9(13(18)19)10(15)7-8/h3-7,14-15,18H,2H2,1H3
charge 0 multiplicity 1
33 atoms
O  4.548199 2.16611 0.04582
O  -5.915112 -0.45736 -0.013816
O  6.061647 -1.807924 0.036802
O  -0.985209 -1.587742 0.01796
O  6.505425 0.464321 0.044442
O  -5.007385 1.697146 0.040292
N  0.030142 0.54286 0.035586
C  1.409225 0.223188 0.03591
C  4.20217 -0.277715 0.038001
C  2.317746 1.308987 0.040644
C  3.707426 1.074466 0.041567
C  1.887766 -1.125448 0.031917
C  3.26818 -1.350462 0.033217
C  -1.075493 -0.323064 0.027528
C  5.645384 -0.48378 0.039663
C  -2.381499 0.399742 0.030116
C  -7.28897 0.137666 -0.016795
C  -3.56167 -0.27733 0.015146
C  -8.272688 -1.024715 -0.087904
C  -4.855529 0.448618 0.017908
H  1.97251 2.348403 0.043395
H  1.173403 -1.948603 0.02804
H  3.654547 -2.373836 0.03046
H  -0.186423 1.543413 0.040915
H  -2.403468 1.498792 0.04389
H  -7.40427 0.740188 0.902459
H  -7.367271 0.818013 -0.884208
H  -3.575813 -1.372188 0.000089
H  5.511901 1.825769 0.045967
H  -9.307606 -0.636953 -0.092623
H  -8.119318 -1.615409 -1.006651
H  -8.15708 -1.694155 0.781087
H  7.056131 -1.833901 0.038776
