program: Gaussian 09
title: 000258354
version: EM64L-G09RevD.01
frameworkgroup: C1[X(C20H20O6)]
method: RPBEPBE
basis: SDD
operation: Freq
keyword: #pfreq=noraman
keyword: PBEPBE/SDD
title: #p freq=noraman PBEPBE/SDD
converged: YES YES NO NO
title: Mulliken charges:
elementType: O O O O O O C C C C C C C C C C C C C C C C C C C C H H H H H H H H H H H H H H H H H H H H
charge: -0.259099 -0.274730 -0.269244 -0.285207 -0.259296 -0.256745 -0.086907 -0.527351 -0.050876 -0.032285 -0.271624 0.222478 -0.497924 0.210408 0.215007 0.194983 -0.339908 -0.337131 -0.344008 -0.331420 -0.222599 -0.219549 -0.222208 -0.223847 -0.236219 -0.223217 0.267118 0.269466 0.244090 0.217302 0.261862 0.224722 0.251998 0.229948 0.237843 0.211995 0.269128 0.270771 0.268757 0.303830 0.233879 0.232124 0.232846 0.233189 0.236083 0.231567
chargesum: 0.00000
title: Mulliken charges with hydrogens summed into heavy atoms:
elementType: O O O O O O C C C C C C C C C C C C C C C C C C C C
charge: -0.259099 -0.274730 -0.269244 -0.285207 -0.259296 -0.256745 0.180211 -0.013796 0.166426 0.229576 0.205097 0.222478 0.181863 0.210408 0.215007 0.194983 -0.070780 -0.066360 -0.075251 -0.027590 0.011279 0.012575 0.010638 0.009342 -0.000136 0.008350
polarizability: 2.66741286e+02 2.16572654e+01 2.66302262e+02 2.73903769e+01 2.86025890e+00 1.58235316e+02
1716.lowfreq: -9.8821 -3.0031 -0.0007 -0.0006 -0.0001 2.2203 9.9862 20.0094 25.8872
frequency: 9.2308 19.9195 25.7959 36.1131 43.0766 58.5558 61.8661 71.9464 80.9602 102.7864 128.3956 133.3041 153.8331 169.0072 176.9333 202.3346 216.6244 230.1168 246.0560 270.4835 301.1080 312.5643 341.7685 380.4943 403.0893 407.8359 432.6558 443.0174 447.0611 459.1766 486.0777 562.1826 594.1402 610.2860 613.2554 613.7763 665.2659 670.1816 680.1091 681.6304 700.9358 707.1122 709.5536 763.4343 795.2317 796.4967 799.4624 822.8618 862.1524 864.6147 874.5335 879.1124 897.0216 918.2514 926.9869 954.5484 964.6998 989.0290 989.7825 992.2238 995.7346 1003.9976 1008.6869 1016.3315 1018.4957 1021.0816 1025.3454 1039.0143 1056.0649 1062.8923 1071.4709 1087.2457 1090.3565 1104.7789 1115.4128 1122.7848 1148.7776 1173.5002 1173.9835 1181.9629 1188.1483 1194.2634 1218.3714 1237.8068 1245.4552 1258.1364 1278.5897 1295.7815 1307.5316 1314.9918 1321.1759 1347.2370 1349.5573 1353.1008 1367.5068 1388.8143 1389.8320 1432.0414 1438.0768 1438.2016 1454.1392 1456.4408 1468.9698 1477.5195 1478.4959 1479.3271 1584.1423 1584.2828 1611.0701 1611.3034 1620.7261 1622.1501 2959.1210 2994.9814 3010.3796 3034.2564 3043.1605 3048.8342 3058.7988 3073.3867 3115.5360 3118.8197 3128.1834 3130.1437 3140.1940 3142.9709 3150.8203 3155.2706 3159.5517 3167.2444 3169.2941 3180.8681
redmass: 6.2090 5.7023 5.2827 4.6026 5.2130 5.8612 4.5407 6.4521 4.8911 4.7735 2.9083 2.0855 4.9650 3.6526 2.2321 4.2248 3.4229 5.7630 5.4117 4.9677 5.3140 2.9233 6.3811 3.9174 2.8199 2.8914 5.1476 3.9756 4.7805 5.8351 5.0297 6.5218 6.2112 2.7684 6.4013 6.4416 6.4521 6.2755 5.0983 5.3994 1.7224 3.1042 2.0115 3.7164 2.2394 2.1887 6.8085 7.2206 3.2251 1.2957 1.2943 3.0201 3.3480 4.8924 2.9607 1.4209 1.4037 5.9232 5.1566 4.3955 1.3902 1.3638 1.3296 3.6452 2.7985 1.4815 2.1859 2.2491 2.4981 3.2059 2.6509 1.7439 1.9861 1.9513 1.2678 2.4087 1.5171 1.0623 1.0587 1.1376 1.1559 1.6017 1.1446 3.1679 2.6871 1.4003 1.4101 1.2984 1.3663 1.3187 1.3110 1.7327 1.3732 1.2900 1.3620 9.3517 10.0333 1.1480 2.2451 2.2421 1.0755 1.0519 1.0979 2.1592 1.0955 2.1927 6.8231 6.5864 6.0452 6.1868 10.2248 10.4841 1.0349 1.0718 1.0724 1.0850 1.0614 1.0867 1.0992 1.1046 1.1055 1.1017 1.0854 1.0855 1.0887 1.0892 1.0931 1.0940 1.0969 1.0983 1.1014 1.0971
irintensity: 0.0521 1.0067 0.4711 0.2655 1.5510 0.8571 3.9596 0.1314 1.2740 1.2159 2.9443 1.5902 0.9537 0.6547 2.9266 3.4684 4.1973 3.6204 8.7396 4.7835 9.6680 2.2474 2.0943 20.1534 0.0317 0.0706 5.4431 1.1576 5.8755 2.5043 9.3024 13.0094 0.5351 1.0458 0.0734 0.6259 0.5639 3.8855 13.1796 15.0088 78.4916 19.9571 91.0588 13.5109 17.7778 23.3760 10.3952 4.9684 37.1465 1.4354 1.8071 30.1779 49.7385 64.0561 41.5308 3.4515 4.0409 0.9408 1.3931 4.4949 0.0697 0.4393 0.1861 108.0500 67.9079 12.6606 68.0285 24.5749 15.6974 304.4172 153.7420 22.1366 59.1988 54.9506 1.3624 33.8146 2.8445 2.1564 0.6737 45.1733 30.2048 5.9439 10.9770 325.4097 255.6634 17.9822 93.6537 5.0181 1.2297 1.0978 0.8435 12.9394 11.1409 7.0063 5.7008 4.2444 3.0052 6.5784 13.1107 19.8867 6.2314 20.9156 13.9227 9.6384 10.3194 6.5119 36.4704 36.1152 16.6904 9.4382 151.9078 212.0220 60.2023 3.3245 72.0710 7.7129 15.9983 38.5605 41.3891 13.2622 15.8317 20.5173 1.5589 0.3384 17.0096 10.7821 6.8709 15.6476 6.7951 22.9389 29.4510 6.7745
temp: 298.150 k
press: 1.00000 atm
elementType: 8 8 8 8 8 8 6 6 6 6 6 6 6 6 6 6 6 6 6 6 6 6 6 6 6 6 1 1 1 1 1 1 1 1 1 1 1 1 1 1 1 1 1 1 1 1
symmnumber: 1
zpe: 945432.6 jmol-1
zpe.correction: 0.360096 hartree
zpe.thermalcorrener: 0.383923 hartree
zpe.thermalcorrenthalpy: 0.384867 hartree
zpe.thermalcorrgfe: 0.302271 hartree
zpe.sumelectzpe: -1223.572920 hartree
zpe.sumelectthermal: -1223.549093 hartree
zpe.sumelectthermalent: -1223.548149 hartree
zpe.sumelectthermalfe: -1223.630745 hartree
dipole: 1.7932 2.3471 -0.8010
dipole: 3.0604
quadrupole: -155.2097 -133.7122 -145.9569
quadrupole: 3.3259 -3.7654 6.4459
quadrupole: -10.2502 11.2474 -0.9973 3.3259 -3.7654 6.4459
hfenergy: -1223.9330158 hartree
pointgroup: C01 [X(C20H20O6)]
dipole: -0.6639742 0.9260598 0.388939 debye
polarizability: 264.8886648|-23.642482|268.1643354|25.3815037|4.5393168|158.2258644 unknown
InChI: InChI=1S/C20H20O6/c1-23-20-17(26-19(22)15-10-6-3-7-11-15)12-16(25-20)13-24-18(21)14-8-4-2-5-9-14/h2-11,16-17,20H,12-13H2,1H3
charge 0 multiplicity 1
46 atoms
O  0.63832 -3.050479 -0.96682
O  -1.980478 -0.978301 0.602629
O  -0.104089 -0.772508 -1.399741
O  2.550383 -1.19541 0.412152
O  -3.486538 -1.593179 -1.066512
O  4.852401 -1.208176 0.775868
C  -1.180772 -2.170767 0.270557
C  0.002493 -2.258968 1.249835
C  1.048746 -3.100425 0.476657
C  -0.498824 -2.13262 -1.120201
C  2.501314 -2.65426 0.632556
C  -3.13283 -0.784692 -0.17149
C  0.510473 -0.63023 -2.729694
C  -3.859737 0.458681 0.206833
C  3.802616 -0.579373 0.491249
C  3.704266 0.880062 0.201979
C  -5.080787 0.743221 -0.458717
C  -3.365417 1.350601 1.194121
C  4.881208 1.664699 0.313851
C  2.475916 1.484135 -0.179723
C  -5.803954 1.909482 -0.137135
C  -4.093107 2.516676 1.512095
C  -5.311719 2.797887 0.849178
C  4.832224 3.048792 0.05007
C  2.435489 2.870145 -0.441924
C  3.608962 3.653799 -0.327244
H  -1.833693 -3.061664 0.304565
H  0.383836 -1.240768 1.427548
H  -0.279988 -2.719755 2.209336
H  0.998397 -4.169928 0.761305
H  -1.110938 -2.541305 -1.944043
H  2.880504 -2.885698 1.6465
H  3.146501 -3.160264 -0.1073
H  0.741586 0.43968 -2.843717
H  1.438063 -1.226949 -2.796495
H  -0.196906 -0.947747 -3.522706
H  -5.43999 0.041405 -1.218737
H  -2.420278 1.123124 1.694483
H  5.814886 1.172332 0.605849
H  1.576904 0.865171 -0.270989
H  -6.746367 2.127593 -0.650841
H  -3.712434 3.206337 2.273204
H  -5.874101 3.704727 1.098776
H  5.74045 3.654846 0.13729
H  1.490017 3.339758 -0.734715
H  3.571192 4.729813 -0.532042
