program: Gaussian 09
title: 000258280
version: EM64L-G09RevD.01
frameworkgroup: C1[X(C22H17BrO2)]
method: RPBEPBE
basis: SDD
operation: Freq
keyword: #p
keyword: freq=noraman
keyword: PBEPBE/SDD
title: #p freq=noraman PBEPBE/SDD
converged: YES YES NO NO
title: Mulliken charges:
elementType: Br O O C C C C C C C C C C C C C C C C C C C C C C H H H H H H H H H H H H H H H H H
charge: 0.003046 -0.301873 -0.262206 -0.299675 0.360314 0.503947 -0.363424 -0.402867 -0.417866 -0.368438 -0.188920 -0.170945 -0.231894 -0.232091 -0.227792 -0.240680 0.255218 -0.364270 0.475086 -0.246305 -0.364704 -0.381094 -0.235567 -0.232756 -0.230867 0.261826 0.254867 0.273223 0.262489 0.252135 0.251264 0.249197 0.228799 0.227895 0.230372 0.248512 0.258557 0.231411 0.237347 0.231294 0.232961 0.234473
chargesum: 0.00000
title: Mulliken charges with hydrogens summed into heavy atoms:
elementType: Br O O C C C C C C C C C C C C C C C C C C C C C C
charge: 0.003046 -0.301873 -0.262206 -0.037849 0.360314 0.503947 -0.108557 -0.129644 -0.155377 -0.116302 0.062344 0.078252 -0.003094 -0.004196 -0.227792 -0.010308 0.255218 -0.115758 0.475086 0.012252 -0.133293 -0.143747 -0.004273 0.000205 0.003607
polarizability: 3.94936098e+02 -2.13388334e+01 2.67808190e+02 -1.27959337e+01 -3.03873812e+01 1.82496668e+02
1716.lowfreq: -12.2075 -2.6393 -0.0009 -0.0008 -0.0005 1.5615 8.1551 15.5091 21.8316
frequency: -8.9469 15.4532 21.8213 33.8574 36.4550 45.8955 52.5177 82.4033 96.4374 123.7870 141.6004 155.8635 181.2028 206.0881 224.4035 263.5296 272.9522 281.4325 291.1047 327.5777 362.0514 402.5643 403.3178 405.6105 414.9535 478.0076 488.9903 503.3166 550.0709 579.0257 613.1411 615.4815 616.2812 624.8937 646.7858 671.0666 697.7852 704.2463 704.7271 712.6797 770.2618 775.2367 800.5945 830.4629 837.9957 848.3829 853.5900 858.0658 878.2058 887.5642 898.8925 929.3497 939.5293 956.5842 964.8724 979.6637 981.1557 982.2435 988.7540 991.9501 997.1523 998.3505 999.9954 1013.4317 1025.6998 1027.2531 1061.9667 1083.5654 1084.2798 1106.9476 1115.4073 1173.6590 1174.9111 1185.4005 1190.4864 1191.6350 1191.8675 1218.3143 1220.3064 1278.8447 1291.1408 1297.7139 1300.6550 1321.9232 1337.3724 1343.9080 1367.4097 1386.6444 1387.5000 1388.0543 1441.0238 1445.8482 1472.2535 1484.3333 1485.5044 1578.0612 1582.0781 1594.1956 1599.7013 1602.3938 1613.2484 1614.6629 1644.3749 3004.4154 3101.2002 3123.8343 3125.5061 3129.9835 3130.8921 3136.8217 3140.4274 3142.4876 3150.3064 3153.6094 3159.2955 3160.5171 3164.8172 3168.6965 3169.7933 3180.9661
redmass: 3.8086 7.6377 4.1768 6.4363 4.7033 5.0168 6.4240 6.1019 6.7474 5.6309 4.0241 9.6555 5.2340 5.1988 6.6152 6.8981 4.5941 3.6430 6.5509 5.6355 6.0533 2.7541 2.8600 2.9084 5.1353 3.5575 2.8580 3.7140 5.6058 5.7034 5.6481 5.9584 6.1071 7.1115 5.9696 4.9544 1.6860 3.4110 2.2616 4.3499 2.0166 1.9468 2.0443 3.8618 1.3100 1.2808 2.9120 1.2524 3.1809 1.8190 4.7886 1.4491 1.6286 5.1062 1.4699 1.3705 1.3878 1.4559 6.1900 4.7840 4.3472 1.3153 1.3876 1.2208 2.2045 2.2246 2.5316 1.6068 1.5951 2.0674 1.8668 1.0623 1.0676 1.3029 1.1649 1.3054 1.5915 1.6100 1.8985 1.6567 1.3654 1.8136 1.4008 1.6337 1.2896 1.3270 4.3927 4.1723 5.2143 6.4827 2.2875 2.1368 2.4323 2.2781 2.3119 7.7024 5.7212 6.2951 6.2625 8.3291 6.0190 7.0779 5.6885 1.0828 1.0898 1.0848 1.0866 1.0880 1.0869 1.0896 1.0925 1.0916 1.0967 1.0964 1.0890 1.0916 1.1016 1.1016 1.0956 1.0960
irintensity: 0.0188 0.1798 0.3366 0.2741 0.1552 0.3874 0.8759 0.1320 0.5805 0.9543 0.2829 0.3994 0.4733 1.4799 0.2040 6.7054 0.2931 1.2242 6.8404 3.6012 19.6348 0.0461 0.4627 0.0497 2.0153 17.5044 12.3057 10.8987 43.7506 0.2159 10.2840 7.0776 2.7142 0.3998 10.4239 9.1956 42.0251 21.0634 41.9222 5.7368 57.9778 62.9026 50.0650 14.9644 1.7405 0.4449 16.4810 0.2750 27.4438 8.9752 100.4038 0.0210 1.7492 251.6567 18.1241 1.5811 0.2923 1.0035 6.2396 3.7372 40.6093 9.7048 1.2449 38.1008 1.2623 6.3401 28.4761 8.0999 14.0346 400.2795 302.5263 0.4543 3.1403 0.8762 7.2668 7.5212 15.2211 38.2134 5.8964 10.5236 33.9415 67.1741 5.9790 47.5065 29.8497 1.3856 2.7369 5.7168 6.6542 14.2051 19.7643 14.3271 99.1180 12.6465 18.5246 6.9156 8.9779 18.3809 16.5974 211.7043 0.5970 61.6134 208.5462 21.1594 1.9649 1.2246 4.6728 1.0312 0.6386 7.1704 16.3188 9.8143 28.3250 31.4929 1.4087 8.2575 25.1540 30.3286 6.1836 2.4287
temp: 298.150 k
press: 1.00000 atm
elementType: 35 8 8 6 6 6 6 6 6 6 6 6 6 6 6 6 6 6 6 6 6 6 6 6 6 1 1 1 1 1 1 1 1 1 1 1 1 1 1 1 1 1
symmnumber: 1
zpe: 844957.0 jmol-1
zpe.correction: 0.321827 hartree
zpe.thermalcorrener: 0.342905 hartree
zpe.thermalcorrenthalpy: 0.343849 hartree
zpe.thermalcorrgfe: 0.267337 hartree
zpe.sumelectzpe: -1010.719190 hartree
zpe.sumelectthermal: -1010.698112 hartree
zpe.sumelectthermalent: -1010.697168 hartree
zpe.sumelectthermalfe: -1010.773680 hartree
dipole: 3.5262 0.3583 1.4900
dipole: 3.8448
quadrupole: -137.7338 -143.8067 -152.1872
quadrupole: -17.3770 2.0113 -3.7719
quadrupole: 6.8421 0.7692 -7.6113 -17.3770 2.0113 -3.7719
hfenergy: -1011.0410172 hartree
pointgroup: C01 [X(C22H17Br1O2)]
dipole: 1.3396102 0.4357092 0.5510972 debye
polarizability: 397.3642316|7.2592388|265.7326861|-12.3602837|-31.5130232|182.1440386 unknown
InChI: InChI=1S/C22H17BrO2/c23-20-14-12-19(13-15-20)22(18-9-5-2-6-10-18)25-21(24)16-11-17-7-3-1-4-8-17/h1-16,22H
charge 0 multiplicity 1
42 atoms
Br -5.907305 -4.197709 0.257195
O  -0.276146 -0.132855 -0.110046
O  0.760318 0.946369 -1.919679
C  -1.611653 0.350589 -0.606098
C  -2.62751 -0.756974 -0.342518
C  -1.925945 1.69124 0.051306
C  -4.004794 -0.488307 -0.549947
C  -2.238488 -2.061039 0.042666
C  -1.680386 2.892004 -0.659603
C  -2.422443 1.759178 1.377669
C  -4.977207 -1.496418 -0.379396
C  -3.200489 -3.081875 0.22451
C  -1.93287 4.144288 -0.056052
C  -2.669822 3.009563 1.982896
C  -4.560146 -2.786442 0.008993
C  -2.428138 4.20622 1.266641
C  0.847484 0.270408 -0.861513
C  2.079958 -0.225796 -0.223772
C  4.616509 -0.405805 -0.299154
C  3.300485 0.013822 -0.795774
C  4.797207 -1.142176 0.908968
C  5.770766 -0.06125 -1.06065
C  6.085431 -1.518166 1.333741
C  7.06124 -0.438181 -0.635252
C  7.223515 -1.168882 0.564369
H  -1.500389 0.507551 -1.69725
H  -4.326461 0.517776 -0.841638
H  -1.180044 -2.277444 0.208046
H  -1.274232 2.84017 -1.676327
H  -2.616167 0.832962 1.930709
H  -6.03627 -1.278715 -0.543397
H  -2.89053 -4.086446 0.526398
H  -1.741044 5.067377 -0.614116
H  -3.051554 3.053536 3.009068
H  -2.6238 5.176881 1.736224
H  1.953415 -0.780173 0.710921
H  3.291763 0.585965 -1.7356
H  3.928362 -1.418541 1.516187
H  5.645424 0.505886 -1.991152
H  6.209354 -2.08331 2.264033
H  7.936365 -0.164454 -1.234349
H  8.224135 -1.463928 0.898842
