program: Gaussian 09
title: 000258238
version: EM64L-G09RevD.01
frameworkgroup: C1[X(C16H26N2O2)]
method: RPBEPBE
basis: SDD
operation: Freq
keyword: #p
keyword: freq=noraman
keyword: PBEPBE/SDD
title: #p freq=noraman PBEPBE/SDD
converged: NO YES NO NO
title: Mulliken charges:
elementType: O O N N C C C C C C C C C C C C C C C C H H H H H H H H H H H H H H H H H H H H H H H H H H
charge: -0.462092 -0.304690 -0.117938 -0.170487 -0.030744 -0.446416 -0.392953 -0.434854 -0.352528 -0.406954 -0.105727 0.453234 -0.713925 -0.287194 -0.371198 -0.375733 -0.233368 -0.229190 -0.272260 -0.492061 0.193801 0.222243 0.219855 0.188961 0.221024 0.210432 0.225943 0.184707 0.219438 0.226823 0.216790 0.220196 0.199568 0.239545 0.216766 0.198783 0.217842 0.237286 0.224195 0.358486 0.216543 0.216628 0.223798 0.206043 0.207157 0.234224
chargesum: 0.00000
title: Mulliken charges with hydrogens summed into heavy atoms:
elementType: O O N N C C C C C C C C C C C C C C C C
charge: -0.103606 -0.304690 -0.117938 -0.170487 0.163057 -0.004318 0.017032 0.001521 0.051617 0.036660 0.114469 0.453234 -0.058045 0.129431 -0.133912 -0.151538 -0.016826 -0.012562 -0.048462 0.155363
polarizability: 2.72779348e+02 -2.54415869e+00 1.68071502e+02 4.83500015e+00 -1.59808360e+01 1.49412813e+02
1716.lowfreq: -12.0847 -4.8476 0.0004 0.0005 0.0008 0.8795 13.8872 20.8563 43.1891
frequency: 13.7119 20.4330 43.1549 57.2351 71.0912 75.6078 88.0793 91.9729 111.6267 142.9258 159.2700 172.7585 200.5448 207.0377 222.1870 237.7208 256.7002 276.6417 296.8468 326.7341 335.0564 365.5918 394.7299 414.7064 429.3439 447.8010 465.0700 487.6125 511.1224 522.0745 553.8587 557.0842 613.9353 682.5691 691.8037 717.7779 735.8806 751.3483 801.4344 814.7670 842.2237 850.9805 861.3641 874.9520 913.8918 923.1121 930.1994 952.3956 961.9800 972.3487 975.6881 1003.3485 1022.8664 1030.2111 1038.6458 1059.1553 1063.6516 1066.7153 1085.3567 1089.1270 1100.2723 1105.9735 1116.9645 1128.2756 1140.4332 1155.6549 1157.5434 1170.9079 1181.0250 1196.4732 1198.8475 1220.4043 1234.4276 1250.8301 1259.7645 1266.3712 1278.4399 1290.5271 1317.5156 1325.5793 1333.3435 1334.7849 1345.2798 1348.6357 1359.1302 1373.1611 1376.2508 1378.6732 1389.7008 1394.7477 1406.3502 1437.1511 1448.8100 1454.4761 1458.2559 1460.2716 1464.4679 1472.8649 1475.4919 1477.6432 1485.7064 1488.6174 1493.2514 1503.2126 1574.8953 1621.8141 2852.8259 2874.9018 2915.4792 2922.0395 2931.7094 2941.0581 2959.9666 2968.0942 2972.4547 2977.2192 3004.0839 3009.6680 3014.3046 3016.2232 3036.9258 3043.8285 3049.3609 3068.0991 3084.4816 3104.4608 3119.8604 3126.2740 3149.9389 3154.8867 3167.3888 3519.5015
redmass: 4.5713 4.1468 3.7650 3.4712 2.8824 2.8539 2.2969 3.5082 2.6634 3.6260 2.8877 3.3538 3.6278 1.9942 1.3167 2.0404 2.3347 3.1022 2.1512 3.2444 2.3209 3.0204 3.4357 2.9822 3.3430 2.8338 1.6007 1.4979 2.7519 3.3144 3.1788 4.7398 6.2180 3.1074 1.8659 3.1894 2.1932 1.8755 1.4255 1.3973 2.3221 2.1019 1.5409 2.7080 2.0720 2.9510 2.0898 1.3757 1.9496 1.3315 5.0051 1.8355 2.0151 2.1484 2.4801 2.4607 2.1293 4.6445 2.2403 1.6729 1.8882 2.1917 1.3710 2.0965 2.1034 1.7503 1.8438 1.0574 1.7300 1.5422 1.1424 1.3296 1.2149 1.2669 1.2567 1.4452 1.2488 1.4274 1.2732 1.3231 1.4006 1.4511 1.3915 1.3334 1.6147 1.4238 1.2267 2.5659 3.1383 1.3782 1.6927 1.1444 2.4404 1.1113 1.0549 1.0759 1.0832 1.0462 1.1023 1.0708 1.1307 1.0716 1.1147 2.2074 5.9868 6.0461 1.0723 1.0698 1.0673 1.0709 1.0381 1.0550 1.0814 1.0846 1.0431 1.0561 1.0940 1.1024 1.0917 1.0992 1.0962 1.0913 1.0900 1.0989 1.0993 1.0981 1.0843 1.0884 1.0913 1.0941 1.1004 1.0650
irintensity: 0.4292 0.5979 0.3492 2.0374 0.1862 2.9797 0.9082 1.4875 3.7698 3.3304 1.2352 2.4931 0.6632 1.9114 4.8333 3.9028 1.6511 3.0458 4.0285 7.0361 2.2312 0.0663 4.3513 0.8397 3.3601 1.8328 49.9131 108.6701 18.2075 19.1665 0.6772 1.0424 0.2957 8.5966 36.4950 7.6952 0.7655 82.4576 4.6206 3.6732 3.3625 7.8340 3.8403 16.6964 2.3350 7.9969 41.4193 0.2097 5.5494 1.9939 9.1922 45.9674 47.2176 14.7898 31.1812 40.0546 18.8409 90.2020 11.0950 12.8819 23.8098 16.7587 5.6226 2.8674 19.9192 6.7099 31.1835 0.2160 10.8989 6.0521 6.2068 14.0377 23.7380 19.8190 39.4636 11.8404 17.0090 42.3018 13.3706 9.6616 4.4911 2.0637 9.4688 3.4076 24.7645 2.8334 11.7644 82.1181 20.0089 16.1465 12.2564 0.6926 0.0294 0.3637 15.6586 14.0681 4.9227 8.0442 75.7870 8.1965 61.6224 33.5856 18.8963 109.1239 11.6869 230.9771 69.5128 76.5236 87.6881 53.9083 71.8082 53.6083 43.9537 44.8748 58.3576 20.8996 31.4064 83.2932 50.5360 47.9036 5.7701 18.1650 46.9081 57.1726 41.7333 32.3458 10.5141 11.7842 39.3733 38.2868 7.9139 22.0942
temp: 298.150 k
press: 1.00000 atm
elementType: 8 8 7 7 6 6 6 6 6 6 6 6 6 6 6 6 6 6 6 6 1 1 1 1 1 1 1 1 1 1 1 1 1 1 1 1 1 1 1 1 1 1 1 1 1 1
symmnumber: 1
zpe: 1042679.0 jmol-1
zpe.correction: 0.397135 hartree
zpe.thermalcorrener: 0.418369 hartree
zpe.thermalcorrenthalpy: 0.419313 hartree
zpe.thermalcorrgfe: 0.344927 hartree
zpe.sumelectzpe: -883.629116 hartree
zpe.sumelectthermal: -883.607883 hartree
zpe.sumelectthermalent: -883.606939 hartree
zpe.sumelectthermalfe: -883.681325 hartree
dipole: -1.7453 -0.0351 1.9840
dipole: 2.6426
quadrupole: -126.2905 -117.2347 -126.1117
quadrupole: 4.9247 -13.4249 -3.8814
quadrupole: -3.0782 5.9776 -2.8994 4.9247 -13.4249 -3.8814
hfenergy: -884.0262517 hartree
pointgroup: C01 [X(C16H26N2O2)]
dipole: 0.6658281 0.2509931 0.7580425 debye
polarizability: 273.0285811|-0.8392018|175.0035514|-1.9104747|8.4231687|142.2315308 unknown
InChI: InChI=1S/C16H26N2O2/c1-3-14-11-17(15-7-5-4-6-8-15)9-10-18(14)12-16(19)13-20-2/h4-8,14,16,19H,3,9-13H2,1-2H3
charge 0 multiplicity 1
46 atoms
O  4.681534 -0.686308 -1.753315
O  5.283925 1.325634 0.047634
N  1.252582 -0.415858 -0.261372
N  -1.68187 -0.097217 -0.391623
C  0.301964 -1.461428 0.253864
C  -1.056491 -1.426703 -0.500499
C  0.583877 0.666172 -1.026449
C  -0.767559 1.058309 -0.408833
C  0.097988 -1.344654 1.788226
C  2.435102 -0.963482 -0.968558
C  3.606902 0.030998 -1.050951
C  -3.06762 0.080312 -0.273848
C  1.405585 -1.520219 2.583802
C  4.102426 0.491333 0.324142
C  -3.613531 1.352634 0.090908
C  -3.985081 -0.990957 -0.516898
C  -5.006286 1.53298 0.210192
C  -5.374263 -0.79476 -0.384996
C  -5.904192 0.46529 -0.020916
C  5.969831 1.759048 1.26233
H  0.749492 -2.456931 0.049316
H  -0.904628 -1.724801 -1.561975
H  -1.720312 -2.1795 -0.03971
H  0.420829 0.37313 -2.095232
H  1.229812 1.564091 -1.035846
H  -0.602359 1.468113 0.61316
H  -1.206729 1.86915 -1.022593
H  -0.637709 -2.113431 2.103128
H  -0.35225 -0.361304 2.020558
H  2.796452 -1.854171 -0.424063
H  2.199126 -1.285997 -2.013224
H  3.326027 0.932528 -1.636708
H  1.843535 -2.524798 2.424581
H  2.146426 -0.766717 2.263068
H  1.23291 -1.397673 3.668603
H  4.393307 -0.387249 0.941335
H  3.321362 1.070936 0.856873
H  -2.950168 2.195912 0.305621
H  -3.618503 -1.970591 -0.839082
H  5.500584 -0.134495 -1.63909
H  -5.391436 2.518916 0.496874
H  -6.050043 -1.635435 -0.582878
H  -6.984919 0.611246 0.075809
H  6.332132 0.892131 1.854476
H  5.30429 2.376097 1.901601
H  6.828646 2.36662 0.936358
