program: Gaussian 09
title: 000258249
version: EM64L-G09RevD.01
frameworkgroup: C1[X(C20H22N2O2)]
method: RPBEPBE
basis: SDD
operation: Freq
keyword: #p
keyword: freq=noraman
keyword: PBEPBE/SDD
title: #p freq=noraman PBEPBE/SDD
converged: NO YES NO NO
title: Mulliken charges:
elementType: O O N N C C C C C C C C C C C C C C C C C C C C H H H H H H H H H H H H H H H H H H H H H H
charge: -0.279990 -0.280001 -0.155694 -0.155952 -0.062432 -0.062474 -0.434701 -0.434720 -0.713975 -0.714006 0.129686 0.129752 0.264905 0.265414 -0.338773 -0.376142 -0.376460 -0.338861 -0.241168 -0.223831 -0.223714 -0.241238 -0.228417 -0.228422 0.276035 0.276112 0.251624 0.237245 0.237288 0.251612 0.234627 0.227397 0.223916 0.234631 0.223925 0.227402 0.250525 0.263702 0.263770 0.250596 0.231452 0.231420 0.231435 0.231454 0.232526 0.232521
chargesum: 0.00000
title: Mulliken charges with hydrogens summed into heavy atoms:
elementType: O O N N C C C C C C C C C C C C C C C C C C C C
charge: -0.279990 -0.280001 -0.155694 -0.155952 0.213603 0.213638 0.054168 0.054181 -0.028036 -0.028048 0.129686 0.129752 0.264905 0.265414 -0.088248 -0.112441 -0.112690 -0.088265 -0.009716 0.007589 0.007722 -0.009784 0.004108 0.004099
polarizability: 3.35675410e+02 2.73383266e+01 1.82526785e+02 2.36504432e+01 -2.91828530e+01 1.85840784e+02
1716.lowfreq: -13.4577 -3.9129 -0.0011 -0.0006 0.0009 6.7999 17.2353 37.7971 39.0291
frequency: 17.2347 37.7971 39.0291 42.8914 56.2298 68.9570 78.6191 91.8596 109.2530 175.5187 181.1247 185.2425 187.2857 200.4895 201.5214 235.3092 255.5317 292.3783 295.1492 353.0472 360.9555 368.3882 405.6981 407.4920 422.8774 425.9995 464.7789 466.6162 513.3510 550.9672 587.2704 609.8788 613.9262 614.0838 629.3488 663.8786 680.7042 697.4334 698.5346 707.9351 708.1914 782.6777 784.0252 787.2553 809.5098 818.8533 860.8135 860.8669 896.4491 906.1680 936.6943 936.9444 941.8742 945.4453 983.3102 983.3470 984.3423 989.9065 990.1824 1000.8155 1000.8737 1024.1289 1025.5498 1050.5563 1057.4626 1080.5084 1083.0618 1090.1294 1102.0018 1118.0299 1147.4787 1164.4153 1173.4820 1173.5392 1183.3144 1188.2360 1188.5933 1205.4378 1253.3473 1263.3883 1311.6623 1313.8585 1315.9135 1317.2858 1323.1214 1327.4578 1360.3060 1366.0943 1380.1183 1380.1602 1385.2459 1387.3453 1395.5642 1407.0076 1432.1782 1432.2236 1456.5901 1462.3802 1470.1149 1474.7777 1479.6948 1480.4394 1482.4622 1483.0095 1541.9678 1542.2095 1589.4163 1589.4760 1609.6675 1609.6865 2986.0951 2986.8387 2999.8233 3000.4422 3040.4295 3040.6258 3081.5898 3082.4591 3091.7931 3091.9506 3104.0157 3104.4113 3125.8346 3125.8560 3133.9110 3133.9325 3145.4194 3145.4321 3156.4817 3156.4934 3168.4866 3168.5368
redmass: 5.1459 5.9480 4.8392 4.3566 4.4622 4.2235 4.6847 5.0273 3.5144 2.8798 3.3663 1.5799 1.9447 1.7892 1.8024 3.8866 4.4493 4.0678 4.1227 2.8368 4.3532 4.5093 2.7378 2.8679 4.4609 2.2835 3.9581 3.2007 3.9406 4.4563 5.9009 3.1987 6.4342 6.2513 5.9932 4.8680 4.6833 6.3841 6.7067 1.5948 1.5696 2.0990 2.7798 2.3634 4.2193 2.6390 1.2482 1.2508 2.1419 2.7882 1.4229 1.4235 1.8213 2.0048 1.4247 1.3924 1.6596 5.8222 5.2482 1.3349 1.3394 2.3339 2.3068 1.9509 1.9430 1.6510 1.5978 2.0116 1.9246 2.0680 3.0759 2.3149 1.0592 1.0582 3.1497 1.1157 1.1852 5.1567 1.5933 1.3992 1.4902 1.4829 1.3835 1.5108 1.5856 1.3571 1.3134 1.3454 8.2453 8.0947 1.2533 1.2329 2.4680 2.1402 2.2335 2.2355 1.0784 1.0819 1.0480 1.0532 1.6845 2.2659 1.2899 1.0737 10.1623 10.6642 6.2489 6.2547 6.0470 6.0456 1.0370 1.0359 1.0659 1.0668 1.0856 1.0855 1.0985 1.0984 1.1000 1.1003 1.0958 1.0956 1.0851 1.0851 1.0881 1.0881 1.0926 1.0926 1.0962 1.0962 1.1012 1.1012
irintensity: 0.3558 3.5943 3.2056 0.0003 0.0000 0.0000 4.0842 0.0001 2.5982 0.0001 2.4501 2.8531 0.0028 2.3382 0.0002 11.2247 0.0000 0.3533 0.0000 0.0000 0.0013 15.0613 0.4308 0.0000 0.0001 7.6083 7.9038 0.0066 23.8753 0.0000 14.9617 0.0000 0.5234 0.0062 0.0000 41.2740 0.0002 0.2286 18.1560 162.6914 0.0039 39.7137 20.6307 0.0021 0.0001 22.9011 2.8128 0.0545 0.0000 12.5462 9.0318 0.0483 0.0001 19.1182 0.3190 5.7470 0.0000 1.5864 0.0000 0.4744 0.0026 65.8807 0.0115 164.5903 36.4246 0.0025 18.8987 0.0001 59.4559 0.0001 12.9485 0.0000 1.5813 0.0049 122.6789 0.0098 1.6839 0.0001 0.0005 59.0109 78.8882 0.0014 0.1238 144.8212 158.9468 0.0122 0.0013 49.3458 0.0019 0.6899 0.0003 49.9135 0.0009 309.0482 5.2579 13.8876 10.8849 0.0001 0.0001 30.2328 6.4803 0.0017 13.0271 0.0003 450.9641 2.3893 19.9762 0.1416 0.5088 6.0362 0.0002 30.7998 0.0044 57.9885 23.4684 0.1952 0.0006 53.8778 50.4765 0.0457 28.1932 0.1940 3.2574 0.5043 2.6875 3.3339 36.9494 6.3212 0.2573 43.1069 40.9301 0.5911
temp: 298.150 k
press: 1.00000 atm
elementType: 8 8 7 7 6 6 6 6 6 6 6 6 6 6 6 6 6 6 6 6 6 6 6 6 1 1 1 1 1 1 1 1 1 1 1 1 1 1 1 1 1 1 1 1 1 1
symmnumber: 1
zpe: 990831.5 jmol-1
zpe.correction: 0.377388 hartree
zpe.thermalcorrener: 0.399186 hartree
zpe.thermalcorrenthalpy: 0.400130 hartree
zpe.thermalcorrgfe: 0.324800 hartree
zpe.sumelectzpe: -1033.564904 hartree
zpe.sumelectthermal: -1033.543106 hartree
zpe.sumelectthermalent: -1033.542161 hartree
zpe.sumelectthermalfe: -1033.617491 hartree
dipole: -0.0014 0.0002 0.0023
dipole: 0.0027
quadrupole: -123.6502 -158.6886 -132.1755
quadrupole: 25.9916 1.1251 -2.8428
quadrupole: 14.5212 -20.5172 5.9959 25.9916 1.1251 -2.8428
hfenergy: -1033.9422913 hartree
pointgroup: C01 [X(C20H22N2O2)]
dipole: -0.0006094 -0.0006219 -0.0006048 debye
polarizability: 331.6450652|-44.5491136|158.908017|-5.3435481|-1.2330791|213.4898968 unknown
InChI: InChI=1S/C20H22N2O2/c1-15-13-22(20(24)18-11-7-4-8-12-18)16(2)14-21(15)19(23)17-9-5-3-6-10-17/h3-12,15-16H,13-14H2,1-2H3
charge 0 multiplicity 1
46 atoms
O  -2.420996 -1.547974 1.895896
O  2.420928 1.547888 -1.896217
N  -1.28614 -0.62592 0.078021
N  1.285216 0.621821 -0.081032
C  -0.07133 -1.42583 0.404899
C  0.070437 1.421819 -0.407756
C  -1.067253 0.476197 -0.884747
C  1.066351 -0.480186 0.881869
C  0.355126 -2.309018 -0.787979
C  -0.355982 2.304891 0.785223
C  -2.436628 -0.820475 0.847272
C  2.435697 0.816547 -0.850259
C  -3.728695 -0.186361 0.392834
C  3.728756 0.186225 -0.393391
C  -4.159704 -0.221858 -0.959148
C  4.600717 -0.336437 -1.382215
C  -4.596999 0.339457 1.383211
C  4.156798 0.222256 0.959529
C  -5.430695 0.27998 -1.315823
C  5.862785 -0.852526 -1.020099
C  -5.858337 0.859004 1.023509
C  5.428467 -0.276104 1.318653
C  -6.278423 0.832315 -0.327853
C  6.279909 -0.825386 0.332175
H  -0.358415 -2.064985 1.258862
H  0.357476 2.061032 -1.261694
H  -1.993893 1.059152 -0.99175
H  -0.800686 0.064478 -1.876754
H  0.799752 -0.068404 1.873846
H  1.992979 -1.063131 0.988935
H  -0.492074 -2.929997 -1.1267
H  0.716875 -1.711262 -1.643936
H  1.173927 -2.984373 -0.480314
H  0.491239 2.925813 1.123997
H  -1.17478 2.980299 0.477659
H  -0.717716 1.707043 1.641122
H  -3.517826 -0.671329 -1.725669
H  4.281886 -0.312176 -2.429413
H  -4.276028 0.314846 2.429749
H  3.511945 0.669365 1.724939
H  -5.760608 0.233476 -2.359496
H  6.525109 -1.263912 -1.789664
H  -6.517816 1.272751 1.794252
H  5.756009 -0.229259 2.363058
H  -7.262286 1.226322 -0.605905
H  7.264324 -1.216674 0.612102
