program: Gaussian 09
title: 000258253
version: EM64L-G09RevD.01
frameworkgroup: C1[X(C22H19NO3)]
method: RPBEPBE
basis: SDD
operation: Freq
keyword: #p
keyword: freq=noraman
keyword: PBEPBE/SDD
title: #p freq=noraman PBEPBE/SDD
converged: YES YES NO NO
title: Mulliken charges:
elementType: O O O N C C C C C C C C C C C C C C C C C C C C C C H H H H H H H H H H H H H H H H H H H
charge: -0.364800 -0.255200 -0.213613 -0.443726 -0.568352 -0.536440 0.468258 0.196678 0.265373 -0.424931 -0.376794 0.252833 -0.324291 -0.224817 -0.230957 -0.297017 -0.250344 -0.231543 -0.240048 0.227479 0.147216 -0.334005 -0.333889 -0.221378 -0.209156 -0.232742 0.217601 0.252006 0.247374 0.221488 0.343562 0.234996 0.250137 0.310595 0.218863 0.231846 0.279394 0.233591 0.229923 0.231172 0.270239 0.277135 0.236607 0.234909 0.234770
chargesum: 0.00000
title: Mulliken charges with hydrogens summed into heavy atoms:
elementType: O O O N C C C C C C C C C C C C C C C C C C C C C C
charge: -0.364800 -0.255200 -0.213613 -0.100164 -0.098745 -0.067578 0.468258 0.196678 0.265373 -0.189935 -0.126657 0.252833 -0.013696 -0.005953 0.000889 -0.017622 -0.016753 -0.001620 -0.008877 0.227479 0.147216 -0.063767 -0.056754 0.015229 0.025753 0.002028
polarizability: 3.14796603e+02 -3.49344865e+01 2.70501103e+02 -8.37314678e-01 3.46802911e+01 1.75033970e+02
1716.lowfreq: -4.3134 -0.0006 -0.0004 0.0007 1.1456 6.9609 17.7866 22.3584 26.1182
frequency: 17.5416 22.3095 26.0620 35.9503 39.8550 47.7388 66.2717 71.5540 88.9683 101.5002 147.6738 155.9098 168.2715 197.8384 228.6716 248.4565 283.2616 305.1861 320.0149 348.2253 362.8740 402.5320 404.9464 414.3176 428.6324 457.8242 463.8586 485.7938 524.8999 547.2702 562.6321 573.2016 613.2237 617.0016 626.4448 669.0287 675.3326 701.3425 702.1775 707.1378 717.3916 736.9820 755.8618 759.5301 767.7119 770.9168 795.3004 802.4780 837.9819 855.8429 866.8254 875.1008 886.9366 915.1860 937.9277 949.6762 957.6376 974.8863 977.8138 989.2542 989.8642 991.3393 996.3519 998.6725 999.7374 1011.4412 1012.2538 1027.4384 1029.7126 1041.4088 1080.5115 1086.0734 1093.5415 1128.9469 1163.3203 1170.4461 1173.7826 1175.2587 1177.7964 1183.8026 1187.9606 1210.3735 1226.9548 1237.3974 1257.6384 1296.1921 1312.4429 1315.5198 1324.8473 1334.2251 1380.6604 1385.5191 1389.7392 1435.4117 1438.2182 1439.7085 1455.7028 1466.8998 1475.2143 1476.6956 1483.0148 1513.4372 1585.2805 1590.1593 1597.6170 1605.5328 1609.9232 1613.3071 1618.3500 1643.1172 2995.5712 3001.1897 3059.4269 3067.6536 3110.7785 3121.7511 3131.3617 3132.9073 3140.5448 3142.4695 3145.7011 3156.8054 3161.9925 3162.0125 3167.6356 3176.8631 3195.6471 3200.7340 3516.1472
redmass: 5.5143 6.3719 5.8798 4.7001 4.5467 4.9011 5.7831 5.9476 5.1919 4.9847 4.5594 4.6634 4.8714 5.8750 5.5553 7.2043 5.6683 5.0480 3.6722 3.3128 2.4595 2.8298 2.8473 6.5375 4.2684 3.4230 5.2245 4.0364 3.6475 3.6470 3.9314 7.9976 6.4311 6.2291 5.6205 5.5305 6.1895 3.0231 1.6844 1.8935 1.9165 1.8858 2.8181 1.7278 2.2190 2.5099 2.1883 5.1515 5.5575 1.2495 1.2437 1.3930 3.1990 1.5391 2.3870 1.3623 1.4104 2.4103 1.4427 5.6630 5.7859 1.3198 1.3284 2.1250 2.5236 1.3312 2.7844 2.1764 2.1143 2.0706 1.5764 1.6825 2.4791 1.3076 1.9302 1.0835 1.0560 1.0997 1.3005 1.1807 1.1271 2.4450 3.2651 1.6577 1.7439 1.5984 1.5995 1.3200 1.3635 1.3760 7.7233 7.0943 9.7441 2.4185 2.3266 2.1609 1.2226 2.1531 1.1384 2.2626 2.1932 2.4711 6.3661 5.9897 6.0409 7.0100 6.0660 6.1301 4.8880 11.2666 1.0601 1.0611 1.1012 1.1031 1.0863 1.0871 1.0923 1.0857 1.0870 1.0955 1.0890 1.0936 1.0975 1.0985 1.0971 1.0992 1.0946 1.0959 1.0761
irintensity: 0.1264 0.8585 0.9110 0.2552 0.2783 0.7357 4.4404 2.4542 1.0186 0.3730 3.2997 2.4518 1.6999 3.4454 3.7828 2.1536 8.7918 4.6993 0.2410 0.0507 1.5822 0.1459 0.0371 0.9151 1.5832 10.3498 3.8165 6.6337 15.7317 8.2722 1.6964 5.1888 1.2999 0.1164 1.3916 12.5626 7.4606 13.6971 71.2325 58.7182 24.0420 14.8247 12.3299 117.3275 42.7651 10.9661 19.4576 21.0218 2.6620 0.9229 1.9826 3.0951 11.0931 5.4549 9.9842 5.6889 2.0969 5.9360 0.2268 22.0175 1.4894 3.4729 0.8308 113.3956 149.3314 0.5143 4.5094 6.3024 25.2849 77.4053 2.8032 22.4588 122.4412 38.1975 159.7928 4.8470 0.2735 24.3109 23.6682 5.1987 1.0792 5.6190 311.1213 3.5923 0.3674 19.2991 21.6721 1.0684 3.6847 3.5721 2.5170 61.6701 1.8473 144.6220 10.5145 10.4683 8.3120 40.5935 19.5762 5.5270 14.1476 360.3093 17.0062 1.9782 10.5487 157.6683 14.8005 8.7507 64.3863 132.5217 20.8764 32.7328 17.0087 21.8119 6.8083 3.1638 12.7459 0.4350 4.8551 33.1582 9.0492 14.5958 22.3862 20.2084 20.2216 7.8395 3.6455 2.9247 53.3035
temp: 298.150 k
press: 1.00000 atm
elementType: 8 8 8 7 6 6 6 6 6 6 6 6 6 6 6 6 6 6 6 6 6 6 6 6 6 6 1 1 1 1 1 1 1 1 1 1 1 1 1 1 1 1 1 1 1
symmnumber: 1
zpe: 928415.4 jmol-1
zpe.correction: 0.353615 hartree
zpe.thermalcorrener: 0.376049 hartree
zpe.thermalcorrenthalpy: 0.376993 hartree
zpe.thermalcorrgfe: 0.298167 hartree
zpe.sumelectzpe: -1128.376847 hartree
zpe.sumelectthermal: -1128.354413 hartree
zpe.sumelectthermalent: -1128.353469 hartree
zpe.sumelectthermalfe: -1128.432295 hartree
dipole: 3.7457 -2.8263 0.1092
dipole: 4.6936
quadrupole: -147.6845 -148.6968 -146.8267
quadrupole: -10.9701 -5.1668 8.7509
quadrupole: 0.0515 -0.9608 0.9093 -10.9701 -5.1668 8.7509
hfenergy: -1128.7304622 hartree
pointgroup: C01 [X(C22H19N1O3)]
dipole: -1.4427658 1.1503041 0.0724035 debye
polarizability: 312.8613298|-36.9428992|271.8764701|-3.3703137|-34.407943|175.5938767 unknown
InChI: InChI=1S/C22H19NO3/c24-21(16-15-17-9-3-1-4-10-17)23-19-13-7-8-14-20(19)26-22(25)18-11-5-2-6-12-18/h1-14,23H,15-16H2
charge 0 multiplicity 1
45 atoms
O  -0.613086 -1.478803 0.077108
O  3.870131 0.048643 -1.336489
O  -2.191412 -3.210625 -0.146551
N  1.621498 -0.508802 -0.946799
C  2.464553 2.854822 -1.31939
C  2.142707 1.574056 -2.155478
C  1.597586 2.977686 -0.074047
C  2.632244 0.303843 -1.452497
C  1.742007 -1.732722 -0.241592
C  0.388177 3.720585 -0.104581
C  1.957101 2.320702 1.132709
C  0.539256 -2.304458 0.270153
C  2.965903 -2.415236 -0.024115
C  -0.442925 3.803039 1.036362
C  1.127832 2.398126 2.274347
C  0.536235 -3.522759 0.971421
C  -0.076679 3.138969 2.230451
C  2.965627 -3.64012 0.678106
C  1.763687 -4.194974 1.172057
C  -2.915442 -0.877999 -0.165109
C  -1.930169 -1.991151 -0.080206
C  -4.245441 -1.207037 -0.540831
C  -2.573993 0.469789 0.126289
C  -5.221882 -0.195879 -0.636721
C  -3.55815 1.476212 0.032936
C  -4.879832 1.148166 -0.351298
H  2.315321 3.734645 -1.972443
H  3.536889 2.820429 -1.052447
H  2.685055 1.635984 -3.116535
H  1.059533 1.535126 -2.377687
H  0.659696 -0.167465 -1.029908
H  0.102578 4.245532 -1.025168
H  2.89235 1.74892 1.175873
H  3.888052 -1.972759 -0.404207
H  -1.362981 4.398867 1.000274
H  1.422543 1.885175 3.196626
H  -0.400598 -3.944325 1.338648
H  -0.716416 3.204727 3.117667
H  3.914923 -4.162317 0.837911
H  1.772908 -5.146691 1.712836
H  -4.488788 -2.253661 -0.751793
H  -1.557092 0.721862 0.440475
H  -6.245352 -0.451311 -0.930922
H  -3.291643 2.512964 0.26379
H  -5.640408 1.933627 -0.42402
