program: Gaussian 09
title: 000258233
version: EM64L-G09RevD.01
frameworkgroup: C1[X(C16H16ClN3O)]
method: RPBEPBE
basis: SDD
operation: Freq
keyword: #p
keyword: freq=noraman
keyword: PBEPBE/SDD
title: #p freq=noraman PBEPBE/SDD
converged: YES YES NO NO
title: Mulliken charges:
elementType: Cl O N N N C C C C C C C C C C C C C C C C H H H H H H H H H H H H H H H H
charge: -0.058872 -0.275950 -0.170249 -0.140054 -0.005668 -0.401019 -0.401791 -0.393244 -0.383927 0.540153 0.141819 -0.299136 -0.340796 0.251636 -0.219331 -0.238101 -0.243990 -0.284876 -0.437258 -0.180201 -0.333730 0.199495 0.241713 0.244427 0.230753 0.227264 0.245711 0.258197 0.239545 0.245746 0.253852 0.228972 0.235585 0.275866 0.265104 0.235507 0.246849
chargesum: 0.00000
title: Mulliken charges with hydrogens summed into heavy atoms:
elementType: Cl O N N N C C C C C C C C C C C C C C C C
charge: -0.058872 -0.275950 -0.170249 -0.140054 -0.005668 0.040189 0.073389 0.079731 0.113815 0.540153 0.141819 -0.299136 -0.095050 0.251636 0.034521 -0.009129 -0.008405 -0.009010 -0.172154 0.055305 -0.086881
polarizability: 2.94952828e+02 -8.54938245e+00 1.83242931e+02 4.93229408e+00 -5.41042871e+00 1.44522126e+02
1716.lowfreq: -9.2756 0.0015 0.0024 0.0026 3.1380 10.3186 22.7091 36.8256 46.2418
frequency: 22.5630 36.6366 46.2109 62.2044 78.0418 81.5797 106.6469 154.0490 180.5831 211.6533 226.6204 236.8038 289.3984 305.5081 318.5570 339.4807 366.2149 385.6226 402.5857 412.3183 446.4468 463.1036 476.3347 487.7465 546.9879 564.4023 603.7790 616.0348 633.2036 655.4084 699.2758 711.3763 714.9202 726.1946 730.0202 754.5574 828.2409 841.4972 847.0004 861.8816 926.3322 932.0972 932.3111 954.8003 962.1135 973.1947 993.5001 994.9695 1007.5743 1015.3447 1028.5987 1039.1230 1048.1233 1056.0149 1087.1831 1109.8547 1120.7709 1146.8001 1156.7207 1172.5704 1198.0872 1203.1999 1207.3157 1233.0056 1260.6478 1264.7147 1287.5380 1306.8004 1330.0271 1341.1660 1344.0194 1353.6714 1363.1998 1367.3783 1374.6833 1402.2448 1412.6532 1428.0149 1450.6647 1455.7946 1460.5500 1462.4583 1465.8369 1480.2741 1539.1026 1560.4948 1561.9554 1580.8214 1605.2181 2885.4336 2920.4534 2991.7490 3003.4904 3056.5875 3101.4059 3101.9328 3103.8437 3126.3956 3133.5521 3135.5375 3149.2083 3153.5616 3158.4683 3173.1968 3174.6588
redmass: 5.5439 7.3175 5.6811 6.2544 6.2880 4.2721 4.2290 4.7193 5.6326 4.3002 6.2804 4.4777 4.4744 2.6504 2.8600 4.7024 4.7537 3.3662 3.9405 2.5232 3.3118 2.8911 5.2309 4.4140 3.7646 5.4564 7.2911 3.6741 3.7175 4.5447 7.3751 4.2188 4.0084 2.0779 3.8043 1.3074 1.8689 1.5376 1.4714 3.6600 3.3901 1.4057 1.4105 1.4813 2.3662 1.3335 1.5833 2.6651 4.8876 4.3826 2.9406 2.4534 1.7422 2.0117 2.1894 1.6600 1.8967 2.8529 2.1932 1.0860 1.6333 2.5537 1.0659 1.5441 1.4399 1.8344 1.4470 10.7969 1.2735 1.2839 1.3864 1.8264 1.6144 2.3065 1.7166 2.0283 2.2491 2.4231 1.0961 1.4034 1.1498 1.5908 1.1719 2.4394 6.0691 7.2854 6.0091 5.9367 6.8609 1.0697 1.0719 1.0666 1.0650 1.0908 1.0960 1.0989 1.0897 1.0907 1.0855 1.0894 1.0894 1.0916 1.0947 1.1002 1.1005
irintensity: 0.1988 0.1603 1.1493 0.5101 5.4395 0.6870 5.0874 1.5112 0.7249 5.3463 3.6646 0.7578 3.4560 5.0981 5.8710 0.8052 9.7254 2.9526 8.1281 1.8921 6.7491 2.9968 5.9286 2.1250 4.4703 0.2781 5.1646 5.8280 5.6201 21.2170 13.3260 4.0866 7.2048 42.2003 8.6824 91.4893 29.1096 1.4564 1.9524 11.4918 31.4647 0.1876 9.4507 3.0411 1.7285 0.1041 16.7303 61.4606 49.9983 31.7370 26.7660 4.5943 2.4712 4.3901 1.8987 12.7629 12.4908 38.9476 32.5943 0.2812 12.5349 3.1938 3.8216 147.1880 3.6798 132.5240 49.5869 0.8187 3.9521 2.6693 0.5860 45.6380 11.0670 8.5560 18.5754 36.5375 170.4216 11.2108 25.1868 25.8309 12.1500 13.0334 43.7720 114.8204 87.3562 186.4071 3.9475 26.6198 73.9123 63.8386 57.6694 27.7205 36.7030 22.8175 19.4110 2.3039 5.7507 20.5999 5.6338 6.1199 8.8677 11.8451 15.2878 18.8871 14.6010
temp: 298.150 k
press: 1.00000 atm
elementType: 17 8 7 7 7 6 6 6 6 6 6 6 6 6 6 6 6 6 6 6 6 1 1 1 1 1 1 1 1 1 1 1 1 1 1 1 1
symmnumber: 1
zpe: 764417.9 jmol-1
zpe.correction: 0.291151 hartree
zpe.thermalcorrener: 0.309115 hartree
zpe.thermalcorrenthalpy: 0.310060 hartree
zpe.thermalcorrgfe: 0.243272 hartree
zpe.sumelectzpe: -1317.320732 hartree
zpe.sumelectthermal: -1317.302768 hartree
zpe.sumelectthermalent: -1317.301823 hartree
zpe.sumelectthermalfe: -1317.368611 hartree
dipole: 1.5260 3.8692 -0.8858
dipole: 4.2526
quadrupole: -125.5991 -128.6484 -136.7468
quadrupole: -5.2150 4.5860 -7.2773
quadrupole: 4.7323 1.6830 -6.4154 -5.2150 4.5860 -7.2773
hfenergy: -1317.6118829 hartree
pointgroup: C01 [X(C16H16Cl1N3O1)]
dipole: -0.7348084 -1.4962107 -0.143707 debye
polarizability: 292.3485718|-18.424698|186.3503276|-6.9794606|1.2662438|144.0189853 unknown
InChI: InChI=1S/C16H16ClN3O/c17-14-5-1-2-6-15(14)19-8-10-20(11-9-19)16(21)13-4-3-7-18-12-13/h1-7,12H,8-11H2
charge 0 multiplicity 1
37 atoms
Cl -3.774008 2.487664 0.600751
O  2.462354 1.57859 -1.804198
N  -1.71276 0.191566 0.037985
N  1.070079 0.903143 -0.057311
N  4.830227 -0.794966 1.572632
C  -0.685819 -0.813212 0.370789
C  -1.22579 1.166834 -0.974214
C  0.587313 -0.109943 0.904378
C  0.033136 1.884575 -0.456339
C  -3.075899 -0.201189 0.025367
C  2.269452 0.863193 -0.765814
C  -4.138966 0.729977 0.226126
C  -3.459953 -1.566157 -0.142679
C  3.384137 -0.016331 -0.254722
C  -5.491509 0.348803 0.22063
C  -4.811515 -1.966961 -0.123878
C  -5.837518 -1.010837 0.043581
C  4.201137 -0.692037 -1.196738
C  3.759267 -0.083357 1.113472
C  5.30472 -1.440327 -0.739278
C  5.575095 -1.473192 0.649651
H  -0.407612 -1.437603 -0.512874
H  -1.071684 -1.482217 1.159719
H  -2.009183 1.910281 -1.182562
H  -0.984834 0.638951 -1.925396
H  0.34154 0.383545 1.865015
H  1.367288 -0.865319 1.082629
H  0.463739 2.525954 -1.241467
H  -0.234061 2.497425 0.425545
H  -2.680536 -2.316035 -0.312585
H  -6.264257 1.106331 0.383179
H  -5.06208 -3.024756 -0.258976
H  -6.890212 -1.309999 0.049611
H  3.969185 -0.602564 -2.262769
H  3.202923 0.47527 1.875569
H  5.951112 -1.980178 -1.43805
H  6.419294 -2.048027 1.04692
