program: Gaussian 09
title: 000258268
version: EM64L-G09RevD.01
frameworkgroup: C1[X(C29H26N2)]
method: RPBEPBE
basis: SDD
operation: Freq
keyword: #pfreq=noraman
keyword: PBEPBE/SDD
title: #p freq=noraman PBEPBE/SDD
converged: YES YES NO NO
title: Mulliken charges:
elementType: N N C C C C C C C C C C C C C C C C C C C C C C C C C C C C C H H H H H H H H H H H H H H H H H H H H H H H H H H
charge: -0.196851 -0.081532 -0.537426 -0.596716 0.507164 0.466843 0.508668 -0.547972 -0.404266 -0.371982 -0.371909 -0.438372 -0.426076 0.268941 -0.226675 -0.392493 -0.232737 -0.233920 -0.229986 -0.231265 -0.241794 -0.244220 -0.282869 -0.220140 0.485033 -0.301087 -0.378223 -0.392792 -0.235621 -0.234515 -0.238673 0.229843 0.228604 0.230202 0.250011 0.247691 0.233428 0.253907 0.254257 0.237388 0.239060 0.218224 0.239364 0.227425 0.226661 0.227485 0.226157 0.228779 0.227610 0.212080 0.250590 0.216869 0.230684 0.228982 0.228136 0.228694 0.231335
chargesum: 0.00000
title: Mulliken charges with hydrogens summed into heavy atoms:
elementType: N N C C C C C C C C C C C C C C C C C C C C C C C C C C C C C
charge: -0.196851 -0.081532 -0.078979 -0.116503 0.507164 0.466843 0.508668 -0.300282 -0.170838 -0.118075 -0.117652 -0.200984 -0.187017 0.268941 -0.008451 -0.153129 -0.005312 -0.007259 -0.002501 -0.005108 -0.013016 -0.016610 -0.070789 0.030450 0.485033 -0.084218 -0.147538 -0.163810 -0.007485 -0.005822 -0.007338
polarizability: 7.06741378e+02 1.80112130e+01 2.54443794e+02 1.71229653e+01 3.33078385e+00 2.67104504e+02
1716.lowfreq: -6.0461 -0.0007 0.0006 0.0009 1.1012 6.6927 9.0865 9.8805 20.0337
frequency: 6.8540 9.8136 19.9815 22.7221 30.2427 34.6569 41.7356 49.0304 61.1740 76.1310 92.8560 116.1354 143.8299 150.0870 176.0765 184.5132 197.9445 209.7837 230.1192 266.8920 282.5913 300.3534 321.3540 344.4019 359.8860 374.5216 402.1069 403.9662 404.0217 432.3594 452.0044 461.2119 468.0793 490.8517 510.1842 520.4469 534.1827 593.0431 607.1667 614.1889 616.4982 616.9743 620.6455 624.1149 644.0190 685.2771 694.7274 704.6599 706.5413 724.1041 755.5681 755.9218 767.4879 774.4947 807.2249 813.0660 831.1626 845.9073 851.6682 857.4919 860.8371 872.1915 881.4667 883.2370 917.5392 919.3865 927.9788 946.7210 956.5831 960.3409 964.2024 978.4954 979.3902 981.4184 982.2079 987.7059 989.7916 990.4242 993.4033 997.3254 998.2448 1004.1267 1023.5494 1026.1593 1026.6850 1032.3088 1081.8080 1083.9245 1088.4818 1099.3982 1137.7981 1143.5587 1171.4743 1171.8567 1173.2266 1182.7048 1183.9479 1189.2651 1190.8130 1191.4682 1201.0675 1209.3525 1228.7777 1234.3317 1245.4671 1265.7161 1291.9357 1297.2960 1317.0135 1323.8792 1328.5726 1343.8628 1351.4197 1357.5298 1363.8027 1380.0682 1385.1734 1387.7017 1388.6145 1437.3599 1440.4146 1441.5570 1449.0638 1469.3996 1473.4038 1478.1658 1484.0263 1485.0973 1486.5820 1558.4825 1567.2673 1580.6533 1593.2465 1594.9437 1608.9060 1611.3895 1612.4456 1614.1280 1635.3316 2930.6199 2946.4895 3022.1748 3033.3170 3080.3078 3088.7864 3114.9913 3116.7030 3119.0272 3122.2230 3123.4204 3124.2526 3127.7823 3133.1699 3134.1990 3134.5198 3141.1562 3144.7681 3145.0378 3149.8212 3151.9267 3161.7910 3162.3147 3162.3978 3166.7603 3167.3362
redmass: 4.9296 4.8116 5.7226 3.6702 5.4078 4.7216 3.9020 4.7216 4.6728 4.3022 4.4379 5.0438 4.5279 4.0534 4.2636 2.4785 4.7578 4.7615 4.2568 3.9882 4.7881 3.5048 3.0464 4.5552 2.4486 3.8237 2.8266 2.8225 2.7792 2.7486 3.7176 4.0433 3.2605 4.0788 3.1003 4.6033 4.3349 4.5536 5.9024 6.0272 6.3769 6.2371 4.7483 5.6525 4.3556 1.8029 1.6977 2.1799 1.8474 2.6279 2.4832 1.8077 1.6905 1.6125 3.3982 3.8261 4.6606 1.2911 1.4783 1.2504 1.2539 1.5769 3.6028 1.7266 1.4648 1.5581 1.5621 1.9086 1.3810 1.5209 2.2504 2.8558 1.4025 1.5505 1.3860 6.1591 6.1245 6.2284 1.2909 1.3153 1.3367 1.2335 2.2504 2.1828 2.2458 1.9665 1.6633 1.5593 1.5885 1.7453 2.7711 2.7759 1.0561 1.0601 1.0795 1.5667 1.1126 1.2068 1.2453 1.1199 2.9726 2.3976 1.6698 1.4565 1.4351 1.8361 1.5670 1.4566 1.3476 1.3072 1.3423 1.3810 1.4047 1.5729 2.3468 5.5463 4.9255 4.4601 5.3744 2.6326 2.1471 2.1903 2.8952 1.2516 1.3601 2.4385 2.3070 1.9393 1.6491 5.2722 5.9809 5.5395 5.9846 6.1273 6.1138 6.0149 6.4150 6.0577 5.4255 1.0685 1.0865 1.0642 1.0905 1.0892 1.0976 1.0870 1.0860 1.0873 1.0863 1.0868 1.0861 1.0868 1.0901 1.0914 1.0917 1.0913 1.0961 1.0962 1.0928 1.0957 1.1014 1.0934 1.0987 1.1013 1.0953
irintensity: 0.1802 0.0458 0.2430 0.3072 0.2001 0.2951 0.0287 1.3072 0.4908 1.3680 0.3734 1.7193 1.1803 2.5147 3.6499 10.0277 0.6500 0.7678 1.4809 2.9268 7.3003 1.2343 2.7061 3.3606 7.4135 5.6723 0.0235 0.2848 0.0099 4.4962 25.7431 3.0851 3.4321 2.4118 19.3871 4.3290 9.0833 17.6349 4.7169 0.3889 0.4109 0.0908 3.2662 0.4552 5.9276 30.3766 39.7806 36.4372 64.1929 1.1070 8.0747 68.2011 87.2744 37.2143 15.9353 8.7546 2.0159 0.1566 7.0589 0.5207 1.1837 20.3078 4.9474 6.7622 4.2521 26.0924 0.6905 40.7918 0.4234 7.7195 22.2443 47.1894 0.6100 11.5485 0.9372 0.6859 0.1194 1.1554 24.8787 1.2350 2.0287 43.0230 20.3975 3.9803 7.5848 3.1361 8.8875 11.4794 18.8859 8.8404 15.0658 81.2418 0.2575 0.1624 0.1353 2.3962 6.7962 6.8642 0.9709 2.9681 8.8629 4.3443 55.4066 105.2478 11.2398 3.1155 0.4710 0.5779 15.7875 8.5547 6.0507 16.5620 4.8831 15.5407 67.1471 4.8556 4.3274 5.1371 0.3820 36.5267 5.0703 36.4513 2.7584 52.8159 18.8022 129.1625 3.3972 27.9481 16.3934 50.9397 255.5314 40.2384 0.1542 0.5746 159.2363 13.3600 85.6891 2.0537 6.2114 61.9734 50.5822 33.8984 13.6635 18.0030 12.1280 14.6740 1.3545 8.7382 0.6925 1.0000 13.9343 7.4945 18.1590 25.3617 2.6726 7.6361 14.9512 62.7169 17.7189 37.2171 31.4812 10.6372 31.1559 52.6176 15.1540
temp: 298.150 k
press: 1.00000 atm
elementType: 7 7 6 6 6 6 6 6 6 6 6 6 6 6 6 6 6 6 6 6 6 6 6 6 6 6 6 6 6 6 6 1 1 1 1 1 1 1 1 1 1 1 1 1 1 1 1 1 1 1 1 1 1 1 1 1 1
symmnumber: 1
zpe: 1215975.6 jmol-1
zpe.correction: 0.463141 hartree
zpe.thermalcorrener: 0.490041 hartree
zpe.thermalcorrenthalpy: 0.490986 hartree
zpe.thermalcorrgfe: 0.399197 hartree
zpe.sumelectzpe: -1228.012884 hartree
zpe.sumelectthermal: -1227.985983 hartree
zpe.sumelectthermalent: -1227.985039 hartree
zpe.sumelectthermalfe: -1228.076828 hartree
dipole: -0.0785 -0.6200 0.3113
dipole: 0.6982
quadrupole: -139.2274 -179.6036 -173.0436
quadrupole: 4.5255 -2.9098 -0.2803
quadrupole: 24.7308 -15.6454 -9.0854 4.5255 -2.9098 -0.2803
hfenergy: -1228.4760247 hartree
pointgroup: C01 [X(C29H26N2)]
dipole: -0.0934657 0.1743802 -0.1905454 debye
polarizability: 673.7908141|118.8393378|290.2755993|-15.9538189|1.5299637|264.2232629 unknown
InChI: InChI=1S/C29H26N2/c1-4-12-25(13-5-1)18-11-21-30-28-19-10-20-29(22-28)31(23-26-14-6-2-7-15-26)24-27-16-8-3-9-17-27/h1-22H,23-24H2
charge 0 multiplicity 1
57 atoms
N  2.289052 1.116074 -0.432183
N  -2.111063 -0.986718 -0.287251
C  3.395769 1.718722 -1.20482
C  2.590312 0.861186 1.000826
C  1.271099 0.391479 -1.10007
C  3.899512 3.027225 -0.596772
C  3.661851 -0.213272 1.215893
C  0.082278 0.000697 -0.417549
C  1.377588 0.046951 -2.484918
C  2.986671 4.056249 -0.250474
C  3.404947 -1.568676 0.878766
C  5.285585 3.25275 -0.418932
C  4.92959 0.12895 1.74873
C  -0.978308 -0.658292 -1.084117
C  0.326608 -0.629582 -3.141485
C  -0.855732 -0.987967 -2.467839
C  3.452399 5.287333 0.25973
C  4.394327 -2.557225 1.073058
C  5.756504 4.487007 0.087172
C  5.92175 -0.859607 1.947167
C  4.840858 5.508147 0.428281
C  5.656656 -2.206149 1.60938
C  -3.316556 -1.057366 -0.815464
C  -4.455225 -1.45805 -0.008912
C  -6.950115 -1.922288 0.210988
C  -5.733477 -1.531465 -0.511687
C  -6.951159 -2.300905 1.587165
C  -8.193767 -1.925508 -0.486629
C  -8.148065 -2.665338 2.232475
C  -9.392461 -2.290536 0.159993
C  -9.375643 -2.662577 1.524271
H  3.011848 1.940284 -2.216842
H  4.24872 1.014172 -1.322654
H  1.659648 0.568348 1.51112
H  2.922917 1.809107 1.460044
H  -0.076525 0.227821 0.640103
H  2.293169 0.256714 -3.044426
H  1.912245 3.876837 -0.377567
H  2.428586 -1.846589 0.464359
H  5.998178 2.458906 -0.676285
H  5.138306 1.173738 2.012067
H  0.453535 -0.902734 -4.195678
H  -1.642218 -1.551765 -2.98049
H  2.737336 6.075191 0.522789
H  4.181114 -3.600394 0.813126
H  6.83259 4.648359 0.218031
H  6.895945 -0.580146 2.364619
H  5.20289 6.4644 0.822522
H  6.422557 -2.974683 1.763919
H  -3.522554 -0.792798 -1.875176
H  -4.228639 -1.70111 1.036288
H  -5.876923 -1.269375 -1.571892
H  -6.012372 -2.309737 2.151366
H  -8.211406 -1.636786 -1.545151
H  -8.12981 -2.953323 3.289592
H  -10.336551 -2.285374 -0.395892
H  -10.304475 -2.947014 2.030814
